* [cyber] I: Sisyphus-20250329 x86_64 beehive_status: +16 -23 (254)
@ 2025-03-29 6:19 ALT beekeeper
0 siblings, 0 replies; only message in thread
From: ALT beekeeper @ 2025-03-29 6:19 UTC (permalink / raw)
To: sisyphus-cybertalk
16 NEW error logs
Perlbal-1.80-alt1
Result: FAIL
Failed 1/25 test programs. 0/407 subtests failed.
make: *** [Makefile:853: test_dynamic] Error 255
dropbear-2025.87-alt1
> self.socket.bind(self.server_address)
E OSError: [Errno 98] Address already in use
/usr/lib64/python3.12/socketserver.py:478: OSError
--
[233] Mar 29 05:04:33 Pubkey auth succeeded for 'root' with ecdsa-sha2-nistp256 key
SHA256:R9aiyRB+zvEYj1GPYja7NHpJ3H5kZvTrW8SXE+Dawjs from 127.0.0.1:47836
[234] Mar 29 05:04:33 lastlog_perform_login: Couldn't stat /var/log/lastlog: No such
file or directory
[234] Mar 29 05:04:33 lastlog_openseek: /var/log/lastlog is not a file or directory!
[233] Mar 29 05:04:33 Exit (root) from <127.0.0.1:47836>: Exited normally
[233] Mar 29 05:04:33 syslogin_perform_logout: logout(pts/1) returned an error: No such
file or directory
[237] Mar 29 05:04:33 Child connection from 127.0.0.1:47840
--
[242] Mar 29 05:04:34 Pubkey auth succeeded for 'root' with ecdsa-sha2-nistp256 key
SHA256:R9aiyRB+zvEYj1GPYja7NHpJ3H5kZvTrW8SXE+Dawjs from 127.0.0.1:47846
[243] Mar 29 05:04:34 lastlog_perform_login: Couldn't stat /var/log/lastlog: No such
file or directory
[243] Mar 29 05:04:34 lastlog_openseek: /var/log/lastlog is not a file or directory!
[242] Mar 29 05:04:34 Exit (root) from <127.0.0.1:47846>: Exited normally
[242] Mar 29 05:04:34 syslogin_perform_logout: logout(pts/2) returned an error: No such
file or directory
[246] Mar 29 05:04:34 Child connection from 127.0.0.1:47858
--
[251] Mar 29 05:04:35 Pubkey auth succeeded for 'root' with ecdsa-sha2-nistp256 key
SHA256:R9aiyRB+zvEYj1GPYja7NHpJ3H5kZvTrW8SXE+Dawjs from 127.0.0.1:47870
[252] Mar 29 05:04:35 lastlog_perform_login: Couldn't stat /var/log/lastlog: No such
file or directory
[252] Mar 29 05:04:35 lastlog_openseek: /var/log/lastlog is not a file or directory!
[251] Mar 29 05:04:35 Exit (root) from <127.0.0.1:47870>: Exited normally
[251] Mar 29 05:04:35 syslogin_perform_logout: logout(pts/3) returned an error: No such
file or directory
[255] Mar 29 05:04:36 Child connection from 127.0.0.1:47886
--
[260] Mar 29 05:04:37 Pubkey auth succeeded for 'root' with ecdsa-sha2-nistp256 key
SHA256:R9aiyRB+zvEYj1GPYja7NHpJ3H5kZvTrW8SXE+Dawjs from 127.0.0.1:47894
[261] Mar 29 05:04:37 lastlog_perform_login: Couldn't stat /var/log/lastlog: No such
file or directory
[261] Mar 29 05:04:37 lastlog_openseek: /var/log/lastlog is not a file or directory!
[260] Mar 29 05:04:37 Exit (root) from <127.0.0.1:47894>: Exited normally
[260] Mar 29 05:04:37 syslogin_perform_logout: logout(pts/4) returned an error: No such
file or directory
[264] Mar 29 05:04:37 Child connection from 127.0.0.1:47902
--
[269] Mar 29 05:04:38 Pubkey auth succeeded for 'root' with ecdsa-sha2-nistp256 key
SHA256:R9aiyRB+zvEYj1GPYja7NHpJ3H5kZvTrW8SXE+Dawjs from 127.0.0.1:47914
[270] Mar 29 05:04:38 lastlog_perform_login: Couldn't stat /var/log/lastlog: No such
file or directory
[270] Mar 29 05:04:38 lastlog_openseek: /var/log/lastlog is not a file or directory!
guile-fibers-1.3.1-alt1
make check-TESTS
hasher-privd: parent: handle_io: idle time limit (3600 seconds) exceeded
guile30-3.0.10-alt1
# SKIP: 0
# XFAIL: 0
# FAIL: 0
# XPASS: 0
# ERROR: 0
make[6]: Leaving directory '/usr/src/RPM/BUILD/guile30-3.0.10/test-suite/standalone'
--
Running 00-repl-server.test
ERROR: 00-repl-server.test: repl-server: HTTP inter-protocol attack - arguments:
((system-error "fport_write" "~A" ("Broken pipe") (32)))
make[5]: *** [Makefile:2622: tests/00-repl-server.log] Error 1
libsecret-0.21.7-alt1
24/24 libsecret:libsecret / test-service OK 18.04s
Summary of Failures:
20/24 libsecret:libsecret / test-collection FAIL 7.11s (exit status
133 or signal 5 SIGTRAP)
Ok: 23
Expected Fail: 0
Fail: 1
Unexpected Pass: 0
Skipped: 0
Timeout: 0
Full log written to
/usr/src/RPM/BUILD/libsecret-0.21.7/x86_64-alt-linux/meson-logs/testlog.txt
perl-Server-Starter-0.35-alt1.1
stop_server (pid:700811) stopping now (pid:700872)...
hasher-privd: parent: handle_io: idle time limit (3600 seconds) exceeded
python-2.7.18-alt11
self._sslobj.do_handshake()
SSLZeroReturnError: TLS/SSL connection has been closed (EOF) (_ssl.c:735)
Exception in thread Thread-75:
--
self._sslobj.do_handshake()
SSLZeroReturnError: TLS/SSL connection has been closed (EOF) (_ssl.c:735)
Exception in thread Thread-76:
--
self._sslobj.do_handshake()
SSLZeroReturnError: TLS/SSL connection has been closed (EOF) (_ssl.c:735)
Exception in thread Thread-77:
--
self._sslobj.do_handshake()
SSLZeroReturnError: TLS/SSL connection has been closed (EOF) (_ssl.c:735)
Exception in thread Thread-78:
--
self._sslobj.do_handshake()
SSLZeroReturnError: TLS/SSL connection has been closed (EOF) (_ssl.c:735)
Exception in thread Thread-79:
--
self._sslobj.do_handshake()
SSLZeroReturnError: TLS/SSL connection has been closed (EOF) (_ssl.c:735)
Exception in thread Thread-80:
--
self._sslobj.do_handshake()
SSLZeroReturnError: TLS/SSL connection has been closed (EOF) (_ssl.c:735)
Warning -- asyncore.socket_map was modified by test_ftplib
python3-module-eventlet-0.39.1-alt1
> assert ok, 'Expected single line "pass" in stdout'
E AssertionError: Expected single line "pass" in stdout
tests/__init__.py:358: AssertionError
--
assert len(mod._active) == n, 'Expected {} {} threads, got {}'.format(n, tag, mod._active)
AssertionError: Expected 2 post-fork patched threads, got {140199607473984:
<_MainThread(MainThread, started 140199607473984)>}
=============================== warnings summary ===============================
--
=========================== short test summary info ============================
FAILED tests/patcher_test.py::test_fork_after_monkey_patch - AssertionError: ...
= 1 failed, 640 passed, 89 skipped, 12 deselected, 52 warnings in 104.97s (0:01:44) =
INFO : Command's result: FAILURE
INFO : Command's error: Command '['python3', '-m', 'pytest', '-v', '-k', 'not
test_dns_methods_are_green and not test_noraise_dns_tcp and not test_clear and not
test_raise_dns_tcp']' returned non-zero exit status 1.
error: Bad exit status from /usr/src/tmp/rpm-tmp.63970 (%check)
python3-module-jupyter_server-2.15.0-alt2
SKIPPED [7] tests/conftest.py:42: Skipping this test because it's marked
'integration_test'. Run integration tests using the `--integration_tests` flag.
FAILED tests/services/kernels/test_cull.py::test_cull_connected[jp_server_config1]
FAILED tests/services/kernels/test_execution_state.py::test_execution_state
= 2 failed, 984 passed, 15 skipped, 8 deselected, 34 warnings in 204.99s (0:03:24) =
INFO : Command's result: FAILURE
INFO : Command's error: Command '['python3', '-m', 'pytest', '-v', '-W', 'default',
'-m', 'not network', '-k', 'not test_restart_kernel and not test_connection']' returned
non-zero exit status 1.
python3-module-pygeoif-1.5.1-alt1
=========================== short test summary info ============================
FAILED tests/hypothesis/test_multipolygon.py::test_shape - hypothesis.errors....
FAILED tests/hypothesis/test_multipolygon.py::test_bounds - hypothesis.errors...
FAILED tests/hypothesis/test_multipolygon.py::test_convex_hull - hypothesis.e...
FAILED tests/hypothesis/test_multipolygon.py::test_convex_hull_bounds - hypot...
FAILED tests/hypothesis/test_polygon.py::test_from_wkt_epsg_4326 - hypothesis...
FAILED tests/hypothesis/test_polygon.py::test_repr_eval - hypothesis.errors.F...
=========== 6 failed, 423 passed, 1026 warnings in 132.79s (0:02:12) ===========
INFO : Command's result: FAILURE
INFO : Command's error: Command '['python3', '-m', 'pytest', '-v']' returned non-zero
exit status 1.
python3-module-qtsass-0.3.0-alt3
tests/test_functions.py::TestQLinearGradientFunc::test_rgba PASSED [ 89%]
tests/test_watchers.py::test_watchers[PollingWatcher] FAILED [ 91%]
tests/test_watchers.py::test_watchers[None] PASSED [ 94%]
--
SKIPPED [1] tests/test_watchers.py:100: Fails on linux
FAILED tests/test_watchers.py::test_watchers[PollingWatcher] - assert 1 == 2
=================== 1 failed, 35 passed, 1 skipped in 10.68s ===================
python3-module-schemathesis-3.39.9-alt1
=========================== short test summary info ============================
FAILED test_basic_pytest_graphql.py::test_[Query.getBooks] - hypothesis.error...
==================== 1 failed, 3 passed in 79.40s (0:01:19) ====================
--
XPASS test/contrib/test_unique_data.py::test_python_tests[None] - The
`schemathesis.contrib.unique_data` hook is deprecated
FAILED test/specs/graphql/test_pytest.py::test_basic_pytest_graphql - Asserti...
= 1 failed, 2746 passed, 2 skipped, 4 xpassed, 331 warnings in 881.63s (0:14:41) =
INFO : Command's result: FAILURE
INFO : Command's error: Command '['python3', '-m', 'pytest', 'test/']' returned
non-zero exit status 1.
python3-module-textdistance-4.6.3-alt1
XFAIL tests/test_external.py::test_list_of_numbers[Levenshtein] - reason: module not
installed: distance.levenshtein
FAILED tests/test_common.py::test_normalization_same[alg21] - hypothesis.erro...
============ 1 failed, 417 passed, 12 xfailed in 135.02s (0:02:15) =============
INFO : Command's result: FAILURE
INFO : Command's error: Command '['python3', '-m', 'pytest', '-vra']' returned
non-zero exit status 1.
python3-module-vcrpy-7.0.0-alt1
> self.sock.sendall(data)
E BrokenPipeError: [Errno 32] Broken pipe
/usr/lib64/python3.12/http/client.py:1057: BrokenPipeError
--
E ^^^^^^^^^^^^^^^^^
E AttributeError: 'PurePosixPath' object has no attribute '_tail_cached'
E
--
=========================== short test summary info ============================
FAILED tests/unit/test_stubs.py::TestVCRConnection::test_body_consumed_once_stream
FAILED tests/unit/test_vcr.py::test_vcr_path_transformer - pytest.PytestUnrai...
================= 2 failed, 175 passed, 3 deselected in 1.69s ==================
INFO : Command's result: FAILURE
INFO : Command's error: Command '['python3', '-m', 'pytest', '-ra', '-m', 'not online',
'tests/unit/']' returned non-zero exit status 1.
error: Bad exit status from /usr/src/tmp/rpm-tmp.95726 (%check)
qemu-9.2.1-alt1
Summary of Failures:
865/975 qemu:block / io-qcow2-161 ERROR
3.22s exit status 1
Ok: 912
websocat-1.11.0-alt1
exit 1;
print STDERR "Timing OK\n";
POSIX::_exit 0;
END {
exit 1;
' lol
Err 1
++ echo test failed
test failed
+ kill 1250309
23 error logs REMOVED from the list
Cardinal-24.12-alt1
bpftrace-0.22.1-alt1
cosmic-applets-1.0.0-alt0.60.alpha.6
dunst-1.8.1-alt1
gawk-5.1.0.0.213.d04f-alt1
gis-weather-0.8.4.17-alt2
ispell-1:3.2.06-alt14
java-1.8.0-openjdk-0:1.8.0.442.b06-alt1_1jpp8
kakasi-2.3.6-alt1
libcuefile-r475-alt1
mumps-5.3.5-alt3
ocaml-lsp-1.22.0-alt1
perl-Audio-CD-0.05-alt4.2
perl-Math-BigInteger-1.01-alt4.1
polars-cli-0.8.0-alt1
python3-module-anyio-4.8.0-alt2
python3-module-pytz-deprecation-shim-0.1.0.post0-alt3
syslinux1-1.62-alt4.1.qa1
tmux-3.5a-alt1
vaultwarden-1.33.2-alt2
xlsfonts-1.0.6-alt1
zeromq-4.3.4-alt3
zig-0.13.0-alt1
Total 254 error logs.
^ permalink raw reply [flat|nested] only message in thread
only message in thread, other threads:[~2025-03-29 6:19 UTC | newest]
Thread overview: (only message) (download: mbox.gz / follow: Atom feed)
-- links below jump to the message on this page --
2025-03-29 6:19 [cyber] I: Sisyphus-20250329 x86_64 beehive_status: +16 -23 (254) ALT beekeeper
ALT Linux Sisyphus cybertalk
This inbox may be cloned and mirrored by anyone:
git clone --mirror http://lore.altlinux.org/sisyphus-cybertalk/0 sisyphus-cybertalk/git/0.git
# If you have public-inbox 1.1+ installed, you may
# initialize and index your mirror using the following commands:
public-inbox-init -V2 sisyphus-cybertalk sisyphus-cybertalk/ http://lore.altlinux.org/sisyphus-cybertalk \
sisyphus-cybertalk@lists.altlinux.org sisyphus-cybertalk@lists.altlinux.ru sisyphus-cybertalk@lists.altlinux.com
public-inbox-index sisyphus-cybertalk
Example config snippet for mirrors.
Newsgroup available over NNTP:
nntp://lore.altlinux.org/org.altlinux.lists.sisyphus-cybertalk
AGPL code for this site: git clone https://public-inbox.org/public-inbox.git