* [cyber] I: Sisyphus-20250325 x86_64 beehive_status: +18 -17 (276)
@ 2025-03-25 6:07 ALT beekeeper
0 siblings, 0 replies; only message in thread
From: ALT beekeeper @ 2025-03-25 6:07 UTC (permalink / raw)
To: sisyphus-cybertalk
[-- Warning: decoded text below may be mangled, UTF-8 assumed --]
[-- Attachment #1: Type: text/plain; charset=unknown-8bit, Size: 17731 bytes --]
18 NEW error logs
Cardinal-24.12-alt1
ld: ../../carla/build/modules/Release/jackbridge.min.a: error adding symbols: archive
has no index; run ranlib to add one
collect2: error: ld returned 1 exit status
make[2]: *** [../../dpf/Makefile.plugins.mk:557: ../../bin/Cardinal] Error 1
--
ld: ../../carla/build/modules/Release/jackbridge.min.a: error adding symbols: archive
has no index; run ranlib to add one
collect2: error: ld returned 1 exit status
make[2]: *** [../../dpf/Makefile.plugins.mk:600: ../../bin/Cardinal.lv2/Cardinal.so]
Error 1
auditd-plugin-clickhouse-lite-0.1.8-alt2
test/dbtest/plugin_test.py ..
hasher-privd: parent: handle_io: idle time limit (3600 seconds) exceeded
autogen-5.18.16-alt1
# SKIP: 0
# XFAIL: 0
# FAIL: 0
# XPASS: 0
# ERROR: 0
make[4]: Leaving directory '/usr/src/RPM/BUILD/autogen-5.18.16/agen5/test'
--
# SKIP: 0
# XFAIL: 0
# FAIL: 0
# XPASS: 0
# ERROR: 0
make[5]: Leaving directory '/usr/src/RPM/BUILD/autogen-5.18.16/getdefs/test'
--
# SKIP: 0
# XFAIL: 0
# FAIL: 0
# XPASS: 0
# ERROR: 0
make[5]: Leaving directory '/usr/src/RPM/BUILD/autogen-5.18.16/xml2ag/test'
cppcheck-2.16.2-alt1_1_1f61c2e8d
cd /usr/src/RPM/BUILD/cppcheck-2.16.2/x86_64-alt-linux/lib &&
/usr/bin/c++ -DFILESDIR=\"/usr/share/Cppcheck\" -DHAVE_RULES
-I/usr/src/RPM/BUILD/cppcheck-2.16.2/x86_64-alt-linux/lib
-I/usr/src/RPM/BUILD/cppcheck-2.16.2/lib -I/usr/src/RPM/BUILD/cppcheck-2.16.2/externals
-I/usr/src/RPM/BUILD/cppcheck-2.16.2/externals/tinyxml2
-I/usr/src/RPM/BUILD/cppcheck-2.16.2/externals/picojson
-I/usr/src/RPM/BUILD/cppcheck-2.16.2/externals/simplecpp -isystem /usr/include/pcre
-pipe -frecord-gcc-switches -Wall -g -O2 -flto=auto -Wno-error=return-type -O2
-DNDEBUG -std=gnu++11 -O2 -pedantic -Wall -Wextra -Wcast-qual -Wfloat-equal
-Wmissing-declarations -Wmissing-format-attribute -Wno-long-long -Wpacked
-Wredundant-decls -Wundef -Wno-missing-field-initializers -Wno-missing-braces
-Wno-sign-compare -Wno-multichar -Woverloaded-virtual -pipe -Wno-maybe-uninitialized
-Wsuggest-attribute=noreturn -Wno-shadow -Wuseless-cast -Winvalid-pch -include
/usr/src/RPM/BUILD/cppcheck-2.16.2/x86_64-alt-linux/lib/CMakeFiles/cppcheck-core.dir/cmake_pch.hxx
-MD -MT lib/CMakeFiles/cppcheck-core.dir/build/mc_templatesimplifier.cpp.o
-MF CMakeFiles/cppcheck-core.dir/build/mc_templatesimplifier.cpp.o.d
-o CMakeFiles/cppcheck-core.dir/build/mc_templatesimplifier.cpp.o -c
/usr/src/RPM/BUILD/cppcheck-2.16.2/x86_64-alt-linux/lib/build/mc_templatesimplifier.cpp
gmake[2]: Leaving directory '/usr/src/RPM/BUILD/cppcheck-2.16.2/x86_64-alt-linux'
gmake[2]: Entering directory '/usr/src/RPM/BUILD/cppcheck-2.16.2/x86_64-alt-linux'
[ 57%] Building CXX object lib/CMakeFiles/cppcheck-core.dir/build/mc_vf_subfunction.cpp.o
cd /usr/src/RPM/BUILD/cppcheck-2.16.2/x86_64-alt-linux/lib &&
/usr/bin/c++ -DFILESDIR=\"/usr/share/Cppcheck\" -DHAVE_RULES
-I/usr/src/RPM/BUILD/cppcheck-2.16.2/x86_64-alt-linux/lib
-I/usr/src/RPM/BUILD/cppcheck-2.16.2/lib -I/usr/src/RPM/BUILD/cppcheck-2.16.2/externals
-I/usr/src/RPM/BUILD/cppcheck-2.16.2/externals/tinyxml2
-I/usr/src/RPM/BUILD/cppcheck-2.16.2/externals/picojson
-I/usr/src/RPM/BUILD/cppcheck-2.16.2/externals/simplecpp -isystem /usr/include/pcre
-pipe -frecord-gcc-switches -Wall -g -O2 -flto=auto -Wno-error=return-type -O2
-DNDEBUG -std=gnu++11 -O2 -pedantic -Wall -Wextra -Wcast-qual -Wfloat-equal
-Wmissing-declarations -Wmissing-format-attribute -Wno-long-long -Wpacked
-Wredundant-decls -Wundef -Wno-missing-field-initializers -Wno-missing-braces
-Wno-sign-compare -Wno-multichar -Woverloaded-virtual -pipe -Wno-maybe-uninitialized
-Wsuggest-attribute=noreturn -Wno-shadow -Wuseless-cast -Winvalid-pch -include
/usr/src/RPM/BUILD/cppcheck-2.16.2/x86_64-alt-linux/lib/CMakeFiles/cppcheck-core.dir/cmake_pch.hxx
-MD -MT lib/CMakeFiles/cppcheck-core.dir/build/mc_vf_subfunction.cpp.o
-MF CMakeFiles/cppcheck-core.dir/build/mc_vf_subfunction.cpp.o.d
-o CMakeFiles/cppcheck-core.dir/build/mc_vf_subfunction.cpp.o -c
/usr/src/RPM/BUILD/cppcheck-2.16.2/x86_64-alt-linux/lib/build/mc_vf_subfunction.cpp
gmake[2]: Leaving directory '/usr/src/RPM/BUILD/cppcheck-2.16.2/x86_64-alt-linux'
gmake[1]: Entering directory '/usr/src/RPM/BUILD/cppcheck-2.16.2/x86_64-alt-linux'
[ 58%] Built target cppcheck-core
gmake[1]: Leaving directory '/usr/src/RPM/BUILD/cppcheck-2.16.2/x86_64-alt-linux'
gmake: *** [Makefile:146: all] Error 2
dropbear-2025.87-alt1
> self.socket.bind(self.server_address)\r
E OSError: [Errno 98] Address already in use\r
/usr/lib64/python3.12/socketserver.py:478: OSError\r
--
> self.socket.bind(self.server_address)\r
E OSError: [Errno 98] Address already in use\r
/usr/lib64/python3.12/socketserver.py:478: OSError\r
--
> self.socket.bind(self.server_address)\r
E OSError: [Errno 98] Address already in use\r
/usr/lib64/python3.12/socketserver.py:478: OSError\r
--
=========================== short test summary info ============================\r
FAILED test_channels.py::test_tcpflushout[L-4000] - OSError: [Errno 98] Addre...\r
FAILED test_channels.py::test_tcpflushout[L-40000] - OSError: [Errno 98] Addr...\r
FAILED test_channels.py::test_tcpflushout[R-1] - OSError: [Errno 98] Address ...\r
======== 3 failed, 45 passed, 3 skipped, 1 xfailed, 13 rerun in 31.07s =========\r
kicad-1:8.0.8-alt1
-- Found ZLIB: /usr/lib64/libz.so (found version "1.3.1")
Package libidn2 was not found in the pkg-config search path.
Perhaps you should add the directory containing `libidn2.pc'
to the PKG_CONFIG_PATH environment variable
Package 'libidn2', required by 'libcurl', not found
Package libidn2 was not found in the pkg-config search path.
Perhaps you should add the directory containing `libidn2.pc'
to the PKG_CONFIG_PATH environment variable
Package 'libidn2', required by 'libcurl', not found
Package libidn2 was not found in the pkg-config search path.
Perhaps you should add the directory containing `libidn2.pc'
to the PKG_CONFIG_PATH environment variable
Package 'libidn2', required by 'libcurl', not found
Package libidn2 was not found in the pkg-config search path.
Perhaps you should add the directory containing `libidn2.pc'
to the PKG_CONFIG_PATH environment variable
Package 'libidn2', required by 'libcurl', not found
-- Found CURL: /usr/lib64/libcurl.so (found version "8.12.1")
--
-- Found cairo, version 1.18.4
Package bzip2 was not found in the pkg-config search path.
Perhaps you should add the directory containing `bzip2.pc'
to the PKG_CONFIG_PATH environment variable
Package 'bzip2', required by 'freetype2', not found
Package bzip2 was not found in the pkg-config search path.
libgda6-6.0.0-alt2
[715/796] Generating libgda-ui/gdaui6.0_vapi with a custom command
FAILED: libgda-ui/libgdaui-6.0.vapi
/usr/bin/vapigen-0.56 --girdir=/usr/src/RPM/BUILD/libgda-6.0.0/x86_64-alt-linux/libgda
--metadatadir=/usr/src/RPM/BUILD/libgda-6.0.0/libgda-ui --library=libgdaui-6.0
--directory=/usr/src/RPM/BUILD/libgda-6.0.0/x86_64-alt-linux/libgda-ui
--vapidir=/usr/src/RPM/BUILD/libgda-6.0.0/x86_64-alt-linux/libgda --pkg=libxml-2.0
--pkg=gio-2.0 --pkg=libgda-6.0 --pkg=gtk+-3.0 libgda-ui/Gdaui-6.0.gir
../libgda-ui/Gda-6.0-custom.vala
error: Package `libgda-6.0' not found in specified Vala API directories or
GObject-Introspection GIR directories
Generation failed: 1 error(s), 0 warning(s)
node-uglify-js-3.17.0-alt1
JS_Parse_Error
^[[32m√ ^[[39mShould return syntax error
^[[32m√ ^[[39mShould reject duplicated label name
--
String literals
^[[32m√ ^[[39mShould throw syntax error if a string literal contains a newline
^[[32m√ ^[[39mShould handle line continuation correctly
^[[32m√ ^[[39mShould not throw syntax error if a string has a line continuation
^[[32m√ ^[[39mShould throw error in strict mode if string contains escaped
octalIntegerLiteral
--
1) Should compress swarm of unused variables with reasonable performance
^[[31mError: Timed out: 10152ms > 10000ms^[[39m
at done (/usr/src/RPM/BUILD/node-uglify-js-3.17.0/test/mocha.js:62:23)
polars-cli-0.8.0-alt1
Compiling polars-cli v0.8.0 (/usr/src/RPM/BUILD/polars-cli-0.8.0)
hasher-privd: parent: handle_io: idle time limit (3600 seconds) exceeded
python3-module-eventlet-0.39.1-alt1
> assert ok, 'Expected single line "pass" in stdout'
E AssertionError: Expected single line "pass" in stdout
tests/__init__.py:358: AssertionError
--
assert len(mod._active) == n, 'Expected {} {} threads, got {}'.format(n, tag, mod._active)
AssertionError: Expected 2 post-fork patched threads, got {139663754614592:
<_MainThread(MainThread, started 139663754614592)>}
=============================== warnings summary ===============================
--
=========================== short test summary info ============================
FAILED tests/patcher_test.py::test_fork_after_monkey_patch - AssertionError: ...
= 1 failed, 640 passed, 89 skipped, 12 deselected, 52 warnings in 144.29s (0:02:24) =
INFO : Command's result: FAILURE
INFO : Command's error: Command '['python3', '-m', 'pytest', '-v', '-k', 'not
test_dns_methods_are_green and not test_noraise_dns_tcp and not test_clear and not
test_raise_dns_tcp']' returned non-zero exit status 1.
error: Bad exit status from /usr/src/tmp/rpm-tmp.25537 (%check)
python3-module-fastapi-0.115.11-alt1
........................................................................ [ 97%]
hasher-privd: parent: handle_io: idle time limit (3600 seconds) exceeded
python3-module-manilaclient-5.2.0-alt1
raise mismatch_error
testtools.matchers._impl.MismatchError: !=:
reference = ('access_rules_status',
python3-module-mkdocs-1.6.1-alt1
.......................................................................................................................................................................................................................................................................................................................................................................................................................................................................................E...............................................s..................................................s................s...............s........................................................................................................................
ERROR: test_watch_with_broken_symlinks
(mkdocs.tests.livereload_tests.BuildTests.test_watch_with_broken_symlinks)
Traceback (most recent call last):
--
paths = [os.path.join(root, entry.name) for entry in self.listdir(root)]
OSError: [Errno 40] Too many levels of symbolic links:
'/usr/src/tmp/mkdocs_test-djhdqadr/subdir/circular/subdir/circular/subdir/circular/subdir/circular/subdir/circular/subdir/circular/subdir/circular/subdir/circular/subdir/circular/subdir/circular/subdir/circular/subdir/circular/subdir/circular/subdir/circular/subdir/circular/subdir/circular/subdir/circular/subdir/circular/subdir/circular/subdir/circular/subdir/circular/subdir/circular/subdir/circular/subdir/circular/subdir/circular/subdir/circular/subdir/circular/subdir/circular/subdir/circular/subdir/circular/subdir/circular/subdir/circular/subdir/circular/subdir/circular/subdir/circular/subdir/circular/subdir/circular/subdir'
Ran 724 tests in 9.809s
FAILED (errors=1, skipped=4)
INFO : Command's result: FAILURE
INFO : Command's error: Command '['python3', '-m', 'unittest', 'discover', '-p',
'*tests.py', 'mkdocs', '--top-level-directory', '.']' returned non-zero exit status 1.
error: Bad exit status from /usr/src/tmp/rpm-tmp.48512 (%check)
python3-module-openstackclient-7.2.1-alt1
raise mismatch_error
testtools.matchers._impl.MismatchError: !=:
reference = {'admin_state_up',
--
raise mismatch_error
testtools.matchers._impl.MismatchError: !=:
reference = {'admin_state_up',
python3-module-pygeoif-1.5.1-alt1
> assert pygeoif.functions.signed_area(hull) >= 0
E AssertionError: assert -2.938735877055719e-39 >= 0
E + where -2.938735877055719e-39 = <function signed_area at 0x7f1df5d90400>(((-1.0,
0.0), (-0.5, 1.0), (-1.0, 1.1754943508222875e-38), (-1.0, 0.0)))
--
=========================== short test summary info ============================
FAILED tests/hypothesis/test_functions.py::test_fuzz_convex_hull - AssertionE...
=========== 1 failed, 428 passed, 1164 warnings in 62.41s (0:01:02) ============
INFO : Command's result: FAILURE
INFO : Command's error: Command '['python3', '-m', 'pytest', '-v']' returned non-zero
exit status 1.
python3-module-sanic-24.6.0-alt2
=========================== short test summary info ============================
FAILED tests/test_cli.py::test_server_run_with_repl - AssertionError: assert ...
= 1 failed, 1667 passed, 25 skipped, 5 deselected, 3 xfailed, 6 xpassed, 310 warnings
in 154.08s (0:02:34) =
--
INFO : Command's result: FAILURE
INFO : Command's error: Command '['python3', '-m', 'pytest', '-k', 'not
test_websocket_route_with_subprotocols and not test_keep_alive_client_timeout']'
returned non-zero exit status 1.
python3-module-textdistance-4.6.3-alt1
XFAIL tests/test_external.py::test_list_of_numbers[Levenshtein] - reason: module not
installed: distance.levenshtein
FAILED tests/test_compression/test_common.py::test_simmetry[alg0] - hypothesi...
============ 1 failed, 417 passed, 12 xfailed in 106.58s (0:01:46) =============
INFO : Command's result: FAILURE
INFO : Command's error: Command '['python3', '-m', 'pytest', '-vra']' returned
non-zero exit status 1.
zstd-1.5.5-alt2
test206 : ZSTD_adjustCParams() + dictionary OK
test207 : check compression mem usage monotonicity over levels for estimateCCtxSize() : OK
test208 : check estimateCCtxSize() always larger or equal to
ZSTD_estimateCCtxSize_usingCParams() : OK
test209 : thread pool API tests :
thread pool test : threadPool re-use roundtrips: OK
thread pool test : threadPool simultaneous usage: OK
thread pool tests OK
1 \r 6 \r 28 \r 53 \r 61 \r 63
\r 70 \r 77 \r 87 \r 92 \r 102 \r
110 \r 116 \r 130 \r 137 \r 157 \r 163
\r 184 \r 189 \r 198 \r 209 \r 217 \r
228 \r 235 \r 252 \r 254 \r 266 \r 276
\r 278 \r 279 \r 282 \r 293 \r 295 \r
315 \r 317 \r 318 \r 324 \r 328 \r 331
\r 335 \r 343 \r 366 \r 389 \r 390 \r
394 \r 403 \r 409 \r 426 \r 431 \r 443
\r 449 \r 462 \r 474 \r 492 \r 500 \r
505 \r 521 \r 528 \r 537 \r 547 \r 561
\r 579 \r 587 \r 594 \r 603 \r 607 \r
624 \r 629 \r 631 \r 634 \r 647 \r 655
\r 662 \r 665 \r 677 \r 684 \r 687 \r
703 \r 705 \r 720 \r 726 \r 740 \r 755
\r 762 \r 768 \r 773 \r 781 \r 787 \r
803 \r 823 \r 838 \r 850 \r 858 \r 867
\r 882 \r 897 \r 906 \r 912 \r 917 \r
936 \r 948 \r 960 \r 967 \r 973 \r 980
\r 989 \r 995 \r 1010 \r 1017 \r 1018 \r
1022 \r 1034 \r 1039 \r 1042 \r 1050 \r
1055 \r 1064 \r 1068 \r 1072 \r 1086 \r
1094 \r 1102 \r 1105 \r 1109 \r 1116 \r
1126 \r 1145 \r 1154 \r 1157 \r 1160 \r
1167 \r 1168 \r 1173 \r 1174 \r 1175 \r
1190 \r 1203 \r 1224 \r 1240 \r 1251 \r
1262 \r 1280 \r 1295 \r 1306 \r 1316 \r
1332 \r 1335 \r 1346 \r 1364 \r 1378 \r
1382 \r 1395 \r 1403 \r 1423 \r 1436 \r
1453 \r 1465 \r 1468 \r 1472 \r 1473 \r
1488 \r 1491 \r 1499 \r 1502 \r 1511 \r
1524 \r 1531 \r 1533 \r 1548 \r 1558 \r
1563 \r 1582 \r 1591 \r 1595 \r 1607 \r
1630 \r 1636 \r 1646 \r 1650 \r 1657 \r
1668 \r 1673 \r 1676 \r 1682 \r 1688 \r
1701 \r 1730 \r 1734 \r 1749 \r 1762 \r
1788 \r 1807 \r 1813 \r 1818 \r 1830 \r
1836 \r 1845 \r 1860 \r 1863 \r 1877 \r
1881 \r 1886 \r 1895 \r 1902 \r 1919 \r
1926 \r 1944 \r 1945 \r 1951 \r 1959 \r
1965 \r 1975 \r 1986 \r 1992 \r 2008 \r
2025 \r 2032 \r 2052 \r 2066 \r 2096 \r
2110 \r 2129 \r 2161 \r 2175 \r 2189 \r
2199 \r 2204 \r 2212 \r 2213 \r 2226 \r
2227 \r 2233 \r 2253 \r 2254 \r 2264 \r
2278 \r 2282 \r 2288 \r 2290 \r 2301 \r 2302
make: Leaving directory '/usr/src/RPM/BUILD/zstd-1.5.5-alt2/tests'
make: Target 'test' not remade because of errors.
17 error logs REMOVED from the list
ccnet-7.1.1-alt1
fbneo-1.0.0.2-alt1.git93da211
gnuplot-1:6.0.2-alt2
guile22-2.2.7-alt1
lightdm-1.32.0-alt9
llama-swap-92-alt1
openvdb-10.1.0-alt3.1
perl-Net-SIP-0.836-alt1
python3-module-cheroot-10.0.1-alt3
python3-module-jupyter_server-2.15.0-alt2
python3-module-oslo.db-17.1.0-alt1
python3-module-paramiko-3.5.1-alt1
python3-module-pulsectl-asyncio-1.2.2-alt2
python3-module-qtconsole-5.6.1-alt1
python3-module-setuptools-1:75.8.0-alt3
python3-module-terminado-0.18.1-alt1
redis-7.2.7-alt1
Total 276 error logs.
^ permalink raw reply [flat|nested] only message in thread
only message in thread, other threads:[~2025-03-25 6:07 UTC | newest]
Thread overview: (only message) (download: mbox.gz / follow: Atom feed)
-- links below jump to the message on this page --
2025-03-25 6:07 [cyber] I: Sisyphus-20250325 x86_64 beehive_status: +18 -17 (276) ALT beekeeper
ALT Linux Sisyphus cybertalk
This inbox may be cloned and mirrored by anyone:
git clone --mirror http://lore.altlinux.org/sisyphus-cybertalk/0 sisyphus-cybertalk/git/0.git
# If you have public-inbox 1.1+ installed, you may
# initialize and index your mirror using the following commands:
public-inbox-init -V2 sisyphus-cybertalk sisyphus-cybertalk/ http://lore.altlinux.org/sisyphus-cybertalk \
sisyphus-cybertalk@lists.altlinux.org sisyphus-cybertalk@lists.altlinux.ru sisyphus-cybertalk@lists.altlinux.com
public-inbox-index sisyphus-cybertalk
Example config snippet for mirrors.
Newsgroup available over NNTP:
nntp://lore.altlinux.org/org.altlinux.lists.sisyphus-cybertalk
AGPL code for this site: git clone https://public-inbox.org/public-inbox.git