* [cyber] I: Sisyphus-20250324 x86_64 beehive_status: +13 -10 (275)
@ 2025-03-24 6:10 ALT beekeeper
0 siblings, 0 replies; only message in thread
From: ALT beekeeper @ 2025-03-24 6:10 UTC (permalink / raw)
To: sisyphus-cybertalk
13 NEW error logs
ccnet-7.1.1-alt1
ccnetobj.c: In function '_vala_ccnet_peer_stat_get_property':
ccnetobj.c:1871:96: error: macro "G_OBJECT_WARN_INVALID_PROPERTY_ID" requires 3 arguments,
but only 1 given
1871 | G_OBJECT_WARN_INVALID_PROPERTY_ID (objNGS | G_PARAM_READABLE |
G_PARAM_WRITABLE));
--
690 | #define G_OBJECT_WARN_INVALID_PROPERTY_ID(object, property_id, pspec) \
ccnetobj.c:1871:17: error: 'G_OBJECT_WARN_INVALID_PROPERTY_ID' undeclared (first use
in this function)
1871 | G_OBJECT_WARN_INVALID_PROPERTY_ID (objNGS | G_PARAM_READABLE |
G_PARAM_WRITABLE));
ccnetobj.c:1871:17: note: each undeclared identifier is reported only once for each
function it appears in
ccnetobj.c:1871:50: error: expected ';' before ')' token
1871 | G_OBJECT_WARN_INVALID_PROPERTY_ID (objNGS | G_PARAM_READABLE |
G_PARAM_WRITABLE));
ccnetobj.c:1871:97: error: expected statement before ')' token
1871 | G_OBJECT_WARN_INVALID_PROPERTY_ID (objNGS | G_PARAM_READABLE |
G_PARAM_WRITABLE));
In file included from /usr/include/glib-2.0/gobject/gobject.h:26:
ccnetobj.c:1872:58: error: 'klass' undeclared (first use in this function)
1872 | g_object_class_install_property
(G_OBJECT_CLASS (klass), CCNET_ORGANIZATION_CREATOR_PROPERTY,
ccnet_organization_properties[CCNET_ORGANIZATION_CREATOR_PROPERTY] = g_param_spec_string
("creator", "creator", "creator", NULL, G_PARAM_STATIC_STRINGS | G_PARAM_READABLE |
G_PARAM_WRITABLE));
--
1872 | g_object_class_install_property
(G_OBJECT_CLASS (klass), CCNET_ORGANIZATION_CREATOR_PROPERTY,
ccnet_organization_properties[CCNET_ORGANIZATION_CREATOR_PROPERTY] = g_param_spec_string
("creator", "creator", "creator", NULL, G_PARAM_STATIC_STRINGS | G_PARAM_READABLE |
G_PARAM_WRITABLE));
ccnetobj.c:1877:1: error: invalid storage class for function
'ccnet_organization_instance_init'
1877 | ccnet_organization_instance_init (CcnetOrganization * self,
ccnetobj.c:1884:1: error: invalid storage class for function 'ccnet_organization_finalize'
1884 | ccnet_organization_finalize (GObject * obj)
ccnetobj.c:1896:1: error: invalid storage class for function
'ccnet_organization_get_type_once'
1896 | ccnet_organization_get_type_once (void)
ccnetobj.c: In function 'ccnet_organization_get_type_once':
ccnetobj.c:1898:248: error: initializer element is not constant
1898 | static const GTypeInfo g_define_type_info = { sizeof
(CcnetOrganizationClass), (GBaseInitFunc) NULL, (GBaseFinalizeFunc) NULL, (GClassInitFunc)
ccnet_organization_class_init, (GClassFinalizeFunc) NULL, NULL, sizeof (CcnetOrganization),
0, (GInstanceInitFunc) ccnet_organization_instance_init, NULL };
--
ccnetobj.c: In function '_vala_ccnet_peer_stat_get_property':
ccnetobj.c:1918:1: error: invalid storage class for function
'_vala_ccnet_organization_get_property'
1918 | _vala_ccnet_organization_get_property (GObject * object,
fbneo-1.0.0.2-alt1.git93da211
Generating depend file for src/burn/drv/atari/d_arcadecl.cpp...
/bin/sh: line 1: obj/burn/drv/atari/d_arcadecl.d: No such file or directory
make[1]: *** [makefile.sdl2:592: d_arcadecl.d] Error 1
gnuplot-1:6.0.2-alt2
make[1]: Leaving directory '/usr/src/RPM/BUILD/gnuplot-6.0.2/docs'
make[1]: Entering directory '/usr/src/RPM/BUILD/gnuplot-6.0.2/docs'
x86_64-alt-linux-gcc -pipe -frecord-gcc-switches -Wall -g -O2 -flto=auto -lcerf -o
doc2tex doc2tex-doc2tex.o doc2tex-termdoc.o -lm -lopenspecfun -lcerf -lz -lpangocairo-1.0
-lpango-1.0 -lgobject-2.0 -lharfbuzz -lcairo -lglib-2.0
make[1]: Leaving directory '/usr/src/RPM/BUILD/gnuplot-6.0.2/docs'
make[1]: *** Deleting file 'gnuplot.tex'
make[1]: Entering directory '/usr/src/RPM/BUILD/gnuplot-6.0.2/docs'
./doc2tex -figures ./gnuplot.doc gnuplot.tex
make[1]: *** [Makefile:1099: gnuplot.tex] Segmentation fault
make[1]: Leaving directory '/usr/src/RPM/BUILD/gnuplot-6.0.2/docs'
make: *** [Makefile:1102: pdf] Error 2
guile22-2.2.7-alt1
WARNING: (test-suite sxml-xpath): imported module (sxml xpath) overrides core binding
`filter'
FAIL: check-guile
1 of 1 test failed
lightdm-1.32.0-alt9
# SKIP: 0
# XFAIL: 0
# FAIL: 1
# XPASS: 0
# ERROR: 0
See tests/test-suite.log
--
# SKIP: 0
# XFAIL: 0
# FAIL: 1
# XPASS: 0
# ERROR: 0
.. contents:: :depth: 2
FAIL: test-autologin-unknown
** (process:326578): WARNING **: 05:04:14.103: Error loading passwd file: Failed to
open file ?/tmp/.r0/etc/passwd?: No such file or directory
** (process:326599): WARNING **: 05:04:14.109: Error loading passwd file: Failed to
open file ?/tmp/.r0/etc/passwd?: No such file or directory
** (process:326618): WARNING **: 05:04:14.120: Error loading passwd file: Failed to
open file ?/tmp/.r0/etc/passwd?: No such file or directory
** (process:326646): WARNING **: 05:04:14.125: Error loading passwd file: Failed to
open file ?/tmp/.r0/etc/passwd?: No such file or directory
perl-Net-SIP-0.836-alt1
t/23_valid_message.t .................... ok
# Failed test 'DTMF audio generator and extractor for codec pcmu works'
# at t/24_dtmf_audio.t line 24.
--
t/24_dtmf_audio.t (Wstat: 256 (exited 1) Tests: 2 Failed: 1)
Failed test: 1
Non-zero exit status: 1
--
Result: FAIL
Failed 1/23 test programs. 1/1767 subtests failed.
make: *** [Makefile:829: test_dynamic] Error 255
python-2.7.18-alt11
self._sslobj.do_handshake()
SSLZeroReturnError: TLS/SSL connection has been closed (EOF) (_ssl.c:735)
Exception in thread Thread-75:
--
self._sslobj.do_handshake()
SSLZeroReturnError: TLS/SSL connection has been closed (EOF) (_ssl.c:735)
Exception in thread Thread-76:
--
self._sslobj.do_handshake()
SSLZeroReturnError: TLS/SSL connection has been closed (EOF) (_ssl.c:735)
Exception in thread Thread-77:
--
self._sslobj.do_handshake()
SSLZeroReturnError: TLS/SSL connection has been closed (EOF) (_ssl.c:735)
Exception in thread Thread-78:
--
self._sslobj.do_handshake()
SSLZeroReturnError: TLS/SSL connection has been closed (EOF) (_ssl.c:735)
Exception in thread Thread-79:
--
self._sslobj.do_handshake()
SSLZeroReturnError: TLS/SSL connection has been closed (EOF) (_ssl.c:735)
Exception in thread Thread-80:
--
self._sslobj.do_handshake()
SSLZeroReturnError: TLS/SSL connection has been closed (EOF) (_ssl.c:735)
Warning -- asyncore.socket_map was modified by test_ftplib
python3-module-jupyter_server-2.15.0-alt2
SKIPPED [7] tests/conftest.py:42: Skipping this test because it's marked
'integration_test'. Run integration tests using the `--integration_tests` flag.
FAILED tests/services/kernels/test_execution_state.py::test_execution_state
= 1 failed, 985 passed, 15 skipped, 8 deselected, 34 warnings in 213.07s (0:03:33) =
INFO : Command's result: FAILURE
INFO : Command's error: Command '['python3', '-m', 'pytest', '-v', '-W', 'default',
'-m', 'not network', '-k', 'not test_restart_kernel and not test_connection']' returned
non-zero exit status 1.
python3-module-paramiko-3.5.1-alt1
raise socket.error("Socket is closed")\r
OSError: Socket is closed\r
warnings.warn(pytest.PytestUnhandledThreadExceptionWarning(msg))\r
--
^[[36m^[[1m=========================== short test summary info
============================^[[0m\r
^[[31mFAILED^[[0m
tests/test_transport.py::^[[1mServiceRequestingTransportTest::test_server_does_not_respond_to_MSG_UNIMPLEMENTED^[[0m
- paramiko.ssh_exception.AuthenticationException: Authentication timeout.\r
^[[33m= ^[[31m1 failed^[[0m, ^[[32m507 passed^[[0m, ^[[33m^[[1m14 skipped^[[0m, ^[[33m^[[1m54
deselected^[[0m, ^[[33m^[[1m2 xfailed^[[0m, ^[[33m^[[1m4 warnings^[[0m^[[33m in 48.57s^[[0m^[[33m
=^[[0m\r
INFO : Command's result: FAILURE
INFO : Command's error: Command '['inv', 'test']' returned non-zero exit status 1.
python3-module-pulsectl-asyncio-1.2.2-alt2
tests/test_async_with_dummy_instance.py::AsyncDummyTests::test_ext_stream_restore PASSED
[ 29%]
tests/test_async_with_dummy_instance.py::AsyncDummyTests::test_get_peak_sample FAILED
[ 35%]
tests/test_async_with_dummy_instance.py::AsyncDummyTests::test_get_sink_src PASSED [ 41%]
--
> self.assertGreater(peak, 0)
E AssertionError: 0.0 not greater than 0
tests/test_async_with_dummy_instance.py:463: AssertionError
--
=========================== short test summary info ============================
FAILED tests/test_async_with_dummy_instance.py::AsyncDummyTests::test_get_peak_sample
=================== 1 failed, 16 passed, 1 warning in 20.75s ===================
python3-module-qtconsole-5.6.1-alt1
> qtbot.waitUntil(lambda: control.toPlainText().split()[-1] == 'name:')
E pytestqt.exceptions.TimeoutError: waitUntil timed out in 5000 milliseconds
qtconsole/tests/test_00_console_widget.py:163: TimeoutError
--------------------------- Captured stderr teardown ---------------------------
[IPKernelApp] ERROR | Exception during subprocesses termination process PID not found
(pid=340001)
Traceback (most recent call last):
--
--------------------------- Captured stderr teardown ---------------------------
[IPKernelApp] ERROR | Exception during subprocesses termination process PID not found
(pid=355837)
Traceback (most recent call last):
--
--------------------------- Captured stderr teardown ---------------------------
[IPKernelApp] ERROR | Exception during subprocesses termination process PID not found
(pid=340001)
Traceback (most recent call last):
--
--------------------------- Captured stderr teardown ---------------------------
[IPKernelApp] ERROR | Exception during subprocesses termination process PID not found
(pid=340001)
Traceback (most recent call last):
--
--------------------------- Captured stderr teardown ---------------------------
[IPKernelApp] ERROR | Exception during subprocesses termination process PID not found
(pid=355837)
Traceback (most recent call last):
--
--------------------------- Captured stderr teardown ---------------------------
[IPKernelApp] ERROR | Exception during subprocesses termination process PID not found
(pid=340001)
Traceback (most recent call last):
--
--------------------------- Captured stderr teardown ---------------------------
[IPKernelApp] ERROR | Exception during subprocesses termination process PID not found
(pid=355837)
Traceback (most recent call last):
--
--------------------------- Captured stderr teardown ---------------------------
[IPKernelApp] ERROR | Exception during subprocesses termination process PID not found
(pid=369906)
Traceback (most recent call last):
--
=========================== short test summary info ============================
FAILED qtconsole/tests/test_00_console_widget.py::test_input - pytestqt.excep...
======== 1 failed, 45 passed, 1 skipped, 1 warning in 85.30s (0:01:25) =========
python3-module-setuptools-1:75.8.0-alt3
===== 1218 passed, 42 skipped, 10 xfailed, 2 xpassed in 269.58s (0:04:29) ======
hasher-privd: parent: handle_io: idle time limit (3600 seconds) exceeded
python3-module-terminado-0.18.1-alt1
tests/basic_test.py::UniqueTermTests::test_large_io_doesnt_hang ^[[32mPASSED^[[0m^[[32m
[ 77%]^[[0m
tests/basic_test.py::UniqueTermTests::test_max_terminals ^[[31mFAILED^[[0m^[[31m [
88%]^[[0m
tests/basic_test.py::UniqueTermTests::test_unique_processes ^[[32mPASSED^[[0m^[[31m
[100%]^[[0m
--
> self.assertEqual(msg[0], "setup")
^[[1m^[[31mE TypeError: 'NoneType' object is not subscriptable^[[0m
msg = None
--
^[[36m^[[1m=========================== short test summary info
============================^[[0m
^[[31mFAILED^[[0m tests/basic_test.py::^[[1mUniqueTermTests::test_max_terminals^[[0m -
TypeError: 'NoneType' object is not subscriptable
^[[31m========================= ^[[31m^[[1m1 failed^[[0m, ^[[32m8 passed^[[0m^[[31m in
38.36s^[[0m^[[31m =========================^[[0m
INFO : Command's result: FAILURE
INFO : Command's error: Command '['python3', '-m', 'pytest', '-vra']' returned
non-zero exit status 1.
10 error logs REMOVED from the list
fritzing-0.9.6-alt1
libgda6-6.0.0-alt2
libgupnp-igd-1.6.0-alt1
libwebrtc-audio-processing-1.3-alt2
perl-Tie-DBI-1.08-alt1
python3-module-eventlet-0.39.1-alt1
python3-module-mdp-3.6.0.15.g64f14eee-alt4
python3-module-pytest-httpbin-2.1.0-alt1
tmux-3.5a-alt1
zig-0.13.0-alt1
Total 275 error logs.
^ permalink raw reply [flat|nested] only message in thread
only message in thread, other threads:[~2025-03-24 6:10 UTC | newest]
Thread overview: (only message) (download: mbox.gz / follow: Atom feed)
-- links below jump to the message on this page --
2025-03-24 6:10 [cyber] I: Sisyphus-20250324 x86_64 beehive_status: +13 -10 (275) ALT beekeeper
ALT Linux Sisyphus cybertalk
This inbox may be cloned and mirrored by anyone:
git clone --mirror http://lore.altlinux.org/sisyphus-cybertalk/0 sisyphus-cybertalk/git/0.git
# If you have public-inbox 1.1+ installed, you may
# initialize and index your mirror using the following commands:
public-inbox-init -V2 sisyphus-cybertalk sisyphus-cybertalk/ http://lore.altlinux.org/sisyphus-cybertalk \
sisyphus-cybertalk@lists.altlinux.org sisyphus-cybertalk@lists.altlinux.ru sisyphus-cybertalk@lists.altlinux.com
public-inbox-index sisyphus-cybertalk
Example config snippet for mirrors.
Newsgroup available over NNTP:
nntp://lore.altlinux.org/org.altlinux.lists.sisyphus-cybertalk
AGPL code for this site: git clone https://public-inbox.org/public-inbox.git