* [cyber] I: Sisyphus-20210605 x86_64 beehive_status: +10 -26 (75)
@ 2021-06-05 6:39 ALT beekeeper
0 siblings, 0 replies; only message in thread
From: ALT beekeeper @ 2021-06-05 6:39 UTC (permalink / raw)
To: sisyphus-cybertalk
10 NEW error logs
automake_1.11-1.11.6-alt9
checking for upc... no
configure: error: no Unified Parallel C compiler was found
+ exit_status=77
--
+ exit 77
1 of 878 tests failed
(73 tests were not run)
cilk-5.4.6-alt11
perl -I. ./bfnnconv.pl ./cilk-faq.bfnn
no ./cilk-faq.xrefdb (No such file or directory) at ./bfnnconv.pl line 43.
S0 \rS1 \rQ1.1 \rQ1.2 \rQ1.3 \rQ1.4 \rQ1.5
\rQ1.6 \rQ1.7 \rQ1.8 \rS2 \rQ2.1 \rQ2.2
\rQ2.3 \rQ2.4 \rS3 \rQ3.1 \rQ3.2 \rQ3.3
\rQ3.4 \runknown question `compile' at ./bfnnconv.pl line 221, <> line 263.
--
libtool: install: /usr/libexec/rpm-build/install -p .libs/libcilk.g.so.0.0.0
/usr/src/tmp/cilk-buildroot/usr/lib64/libcilk.g.so.0.0.0
/bin/install: cannot stat '.libs/libcilk.g.so.0.0.0': No such file or directory
make[2]: *** [Makefile:565: install-libLTLIBRARIES] Error 1
curl-7.77.0-alt1
TESTDONE: 1128 tests out of 1129 reported OK: 99%
TESTFAIL: These test cases failed: 587
make[1]: *** [Makefile:815: full-test] Error 1
guile22-2.2.7-alt1
UNRESOLVED: 00-socket.test: AF_INET6/SOCK_STREAM: listen
hasher-priv: master: idle time limit (3600 seconds) exceeded
java-atk-wrapper-0.38.0-alt1_4jpp11
/usr/lib/jvm/java-11-openjdk-11.0.9.11-0.3.ea.x86_64/bin/javac -cp ../../../../wrapper
-sourcepath ../../../../wrapper:../../../../wrapper -d ../../../../wrapper
AtkComponent.java
error: cannot access module-info
bad class file: ../../../../wrapper/module-info.class
libgupnp-igd-1.2.0-alt1.1
1/1 gupnp-simple-igd TIMEOUT 60.02s killed by signal 15 SIGTERM
Summary of Failures:
1/1 gupnp-simple-igd TIMEOUT 60.02s killed by signal 15 SIGTERM
Ok: 0
Expected Fail: 0
Fail: 0
Unexpected Pass: 0
Skipped: 0
Timeout: 1
Full log written to
/usr/src/RPM/BUILD/gupnp-igd-1.2.0/x86_64-alt-linux/meson-logs/testlog.txt
perl-Inline-C-0.81-alt1
$load_cfg sub: $config: **
# Failed test 'bind was successful'
# at t/26fork.t line 21.
--
# expected: ''
# Failed test 'bound func no die()'
# at t/26fork.t line 23.
--
# expected: ''
# Failed test 'bound func gave right result'
# at t/26fork.t line 24.
--
t/26fork.t (Wstat: 768 Tests: 4 Failed: 3)
Failed tests: 2-4
Non-zero exit status: 3
--
Result: FAIL
Failed 1/36 test programs. 3/161 subtests failed.
make: *** [Makefile:787: test_dynamic] Error 255
python3-module-pexpect-4.8.0-alt1
=========================== short test summary info ============================
FAILED tests/test_interact.py::InteractTestCase::test_interact_exit_unicode
============ 1 failed, 233 passed, 13 warnings in 179.21s (0:02:59) ============
racket-7.3-alt2
raco setup: 4 re-rendering: <pkgs>/racket-index/scribblings/main/release.scrbl
raco setup: 3 re-rendering: <pkgs>/scribble-doc/scribblings/scribble/scribble.scrbl
raco setup: 2 re-rendering: <pkgs>/racket-index/scribblings/main/start.scrbl
raco setup: 1 re-rendering:
<pkgs>/typed-racket-doc/typed-racket/scribblings/ts-reference.scrbl
raco setup: 0 re-rendering: <pkgs>/racket-index/scribblings/main/local-redirect.scrbl
raco setup: 4 re-rendering: <pkgs>/racket-index/scribblings/main/search.scrbl
make[1]: *** [Makefile:196: install-3m] CPU time limit exceeded
make[1]: Leaving directory '/usr/src/RPM/BUILD/racket-7.3/src'
make: *** [Makefile:119: install] Error 2
make: Leaving directory '/usr/src/RPM/BUILD/racket-7.3/src'
transgui-5.18.0-alt3
$00000000004041A3
$0000000000402423
$0000000000407B83
$000000000040A799
An unhandled exception occurred at $0000000000414425:
EAccessViolation:
$0000000000414425
$00000000009ED7A8
$00000000009F17C4
$00000000009F2A1E
26 error logs REMOVED from the list
R-base-4.0.5-alt1
aalto-xml-1.2.2-alt1_2jpp11
bcc-0.19.0-alt1.1
ctpp-2.7.1-alt2.qa1.1
custodia-0.6.0-alt6
dopewars-1.5.12-alt2_20.1033svn
felix-bundlerepository-2.0.10-alt1_11jpp11
fluidsynth-2.1.8-alt1
kea-1.8.2-alt1
libbox2d-2.4.1-alt1
libsmi-0.5.0-alt1.svn1841
libvxl-2.0.2-alt2
maven-1:3.6.1-alt2_5jpp11
mockito-0:2.23.9-alt1_6jpp8
mpd-0.21.24-alt1
php7-memcache-4.0.5.2-alt7.4.19.alt1
proftpd-1.3.6-alt0.4.ga73dbfe3b
protobuf-3.14.0-alt1
python3-module-iniparse-0.5-alt1
sbcl-2.0.4-alt1
sysdig-0.23.1-alt1
tellico-3.4.1-alt1
tvision-586-alt1
util-linux-2.36.1-alt2
vtk-9.0.1-alt1
xdg-desktop-portal-1.8.1-alt2
Total 75 error logs.
^ permalink raw reply [flat|nested] only message in thread
only message in thread, other threads:[~2021-06-05 6:39 UTC | newest]
Thread overview: (only message) (download: mbox.gz / follow: Atom feed)
-- links below jump to the message on this page --
2021-06-05 6:39 [cyber] I: Sisyphus-20210605 x86_64 beehive_status: +10 -26 (75) ALT beekeeper
ALT Linux Sisyphus cybertalk
This inbox may be cloned and mirrored by anyone:
git clone --mirror http://lore.altlinux.org/sisyphus-cybertalk/0 sisyphus-cybertalk/git/0.git
# If you have public-inbox 1.1+ installed, you may
# initialize and index your mirror using the following commands:
public-inbox-init -V2 sisyphus-cybertalk sisyphus-cybertalk/ http://lore.altlinux.org/sisyphus-cybertalk \
sisyphus-cybertalk@lists.altlinux.org sisyphus-cybertalk@lists.altlinux.ru sisyphus-cybertalk@lists.altlinux.com
public-inbox-index sisyphus-cybertalk
Example config snippet for mirrors.
Newsgroup available over NNTP:
nntp://lore.altlinux.org/org.altlinux.lists.sisyphus-cybertalk
AGPL code for this site: git clone https://public-inbox.org/public-inbox.git