* [cyber] I: p9-20201129 i586 beehive_status: +15 -8 (136)
@ 2020-11-29 13:46 ALT beekeeper
0 siblings, 0 replies; only message in thread
From: ALT beekeeper @ 2020-11-29 13:46 UTC (permalink / raw)
To: sisyphus-cybertalk
[-- Warning: decoded text below may be mangled, UTF-8 assumed --]
[-- Attachment #1: Type: text/plain; charset=unknown-8bit, Size: 30943 bytes --]
15 NEW error logs
apache-commons-pool2-2.4.2-alt4_6jpp8
[ERROR] testMakeConcurrentWithReturn(org.apache.commons.pool2.impl.TestGenericObjectPool)
Time elapsed: 1.663 s <<< FAILURE!
java.lang.AssertionError: expected:<2> but was:<1>
at
org.apache.commons.pool2.impl.TestGenericObjectPool.testMakeConcurrentWithReturn(TestGenericObjectPool.java:2207)
[ERROR] testBorrowObjectFairness(org.apache.commons.pool2.impl.TestGenericObjectPool)
Time elapsed: 4.808 s <<< FAILURE!
java.lang.AssertionError: Thread 36 failed: java.lang.Throwable: Expected: 36 found: 37
at
org.apache.commons.pool2.impl.TestGenericObjectPool.testBorrowObjectFairness(TestGenericObjectPool.java:2037)
chromium-gost-83.0.4103.61-alt2.M90P.1
[39702/40379] clang++ -MMD -MF obj/v8/v8_base_without_compiler/constant-array-builder.o.d
-DUSE_UDEV -DUSE_AURA=1 -DUSE_GLIB=1 -DUSE_NSS_CERTS=1 -DUSE_X11=1 -DOFFICIAL_BUILD
-D_FILE_OFFSET_BITS=64 -D_LARGEFILE_SOURCE -D_LARGEFILE64_SOURCE -DNO_UNWIND_TABLES
-D_GNU_SOURCE -D__STDC_CONSTANT_MACROS -D__STDC_FORMAT_MACROS -D_FORTIFY_SOURCE=2 -DNDEBUG
-DNVALGRIND -DDYNAMIC_ANNOTATIONS_ENABLED=0 -DV8_TYPED_ARRAY_MAX_SIZE_IN_HEAP=64
-DENABLE_MINOR_MC -DV8_INTL_SUPPORT -DV8_USE_EXTERNAL_STARTUP_DATA
-DV8_CONCURRENT_MARKING -DV8_ARRAY_BUFFER_EXTENSION -DV8_ENABLE_LAZY_SOURCE_POSITIONS
-DV8_EMBEDDED_BUILTINS -DV8_SHARED_RO_HEAP -DV8_WIN64_UNWINDING_INFO
-DV8_ENABLE_REGEXP_INTERPRETER_THREADED_DISPATCH -DV8_SNAPSHOT_COMPRESSION
-DV8_DEPRECATION_WARNINGS -DV8_TARGET_ARCH_IA32 -DV8_HAVE_TARGET_OS
-DV8_TARGET_OS_LINUX -DDISABLE_UNTRUSTED_CODE_MITIGATIONS -DV8_DEPRECATION_WARNINGS
-DU_USING_ICU_NAMESPACE=0 -DU_ENABLE_DYLOAD=0 -DUSE_CHROMIUM_ICU=1
-DU_ENABLE_TRACING=1 -DU_ENABLE_RESOURCE_TRACING=0 -DU_STATIC_IMPLEMENTATION
-DICU_UTIL_DATA_IMPL=ICU_UTIL_DATA_FILE -DUCHAR_TYPE=uint16_t -DV8_DEPRECATION_WARNINGS
-I../.. -Igen -I../../v8 -Igen/v8 -I../../third_party/icu/source/common
-I../../third_party/icu/source/i18n -I../../v8/include -I../../third_party/zlib
-fprofile-sample-use=../../chrome/android/profiles/afdo.prof -fno-strict-aliasing
--param=ssp-buffer-size=4 -fstack-protector -fno-unwind-tables
-fno-asynchronous-unwind-tables -fPIC -pthread -fcolor-diagnostics
-fmerge-all-constants -fcrash-diagnostics-dir=../../tools/clang/crashreports
-Xclang -mllvm -Xclang -instcombine-lower-dbg-declare=0 -m32 -msse2 -mfpmath=sse
-mmmx -Xclang -fdebug-compilation-dir -Xclang . -no-canonical-prefixes -Wall
-Wextra -Wimplicit-fallthrough -Wunreachable-code -Wthread-safety -Wextra-semi
-Wno-missing-field-initializers -Wno-unused-parameter -Wno-c++11-narrowing
-Wno-unneeded-internal-declaration -Wno-undefined-var-template -Wno-ignored-pragma-optimize
-Wno-implicit-int-float-conversion -Wno-final-dtor-non-final-class
-Wno-builtin-assume-aligned-alignment -Wno-deprecated-copy -Wno-pointer-to-int-cast
-fno-omit-frame-pointer -momit-leaf-frame-pointer -g0 -fvisibility=hidden
-Wheader-hygiene -Wstring-conversion -Wtautological-overlap-compare
-Wmissing-field-initializers -Wunreachable-code -O3 -fno-ident -fdata-sections
-ffunction-sections -Wexit-time-destructors -std=c++14 -fno-exceptions -fno-rtti
-fvisibility-inlines-hidden -c ../../v8/src/interpreter/constant-array-builder.cc -o
obj/v8/v8_base_without_compiler/constant-array-builder.o
[39703/40379] clang++ -MMD -MF obj/v8/v8_base_without_compiler/bytecode-generator.o.d
-DUSE_UDEV -DUSE_AURA=1 -DUSE_GLIB=1 -DUSE_NSS_CERTS=1 -DUSE_X11=1 -DOFFICIAL_BUILD
-D_FILE_OFFSET_BITS=64 -D_LARGEFILE_SOURCE -D_LARGEFILE64_SOURCE -DNO_UNWIND_TABLES
-D_GNU_SOURCE -D__STDC_CONSTANT_MACROS -D__STDC_FORMAT_MACROS -D_FORTIFY_SOURCE=2 -DNDEBUG
-DNVALGRIND -DDYNAMIC_ANNOTATIONS_ENABLED=0 -DV8_TYPED_ARRAY_MAX_SIZE_IN_HEAP=64
-DENABLE_MINOR_MC -DV8_INTL_SUPPORT -DV8_USE_EXTERNAL_STARTUP_DATA
-DV8_CONCURRENT_MARKING -DV8_ARRAY_BUFFER_EXTENSION -DV8_ENABLE_LAZY_SOURCE_POSITIONS
-DV8_EMBEDDED_BUILTINS -DV8_SHARED_RO_HEAP -DV8_WIN64_UNWINDING_INFO
-DV8_ENABLE_REGEXP_INTERPRETER_THREADED_DISPATCH -DV8_SNAPSHOT_COMPRESSION
-DV8_DEPRECATION_WARNINGS -DV8_TARGET_ARCH_IA32 -DV8_HAVE_TARGET_OS
-DV8_TARGET_OS_LINUX -DDISABLE_UNTRUSTED_CODE_MITIGATIONS -DV8_DEPRECATION_WARNINGS
-DU_USING_ICU_NAMESPACE=0 -DU_ENABLE_DYLOAD=0 -DUSE_CHROMIUM_ICU=1
-DU_ENABLE_TRACING=1 -DU_ENABLE_RESOURCE_TRACING=0 -DU_STATIC_IMPLEMENTATION
-DICU_UTIL_DATA_IMPL=ICU_UTIL_DATA_FILE -DUCHAR_TYPE=uint16_t -DV8_DEPRECATION_WARNINGS
-I../.. -Igen -I../../v8 -Igen/v8 -I../../third_party/icu/source/common
-I../../third_party/icu/source/i18n -I../../v8/include -I../../third_party/zlib
-fprofile-sample-use=../../chrome/android/profiles/afdo.prof -fno-strict-aliasing
--param=ssp-buffer-size=4 -fstack-protector -fno-unwind-tables
-fno-asynchronous-unwind-tables -fPIC -pthread -fcolor-diagnostics
-fmerge-all-constants -fcrash-diagnostics-dir=../../tools/clang/crashreports
-Xclang -mllvm -Xclang -instcombine-lower-dbg-declare=0 -m32 -msse2 -mfpmath=sse
-mmmx -Xclang -fdebug-compilation-dir -Xclang . -no-canonical-prefixes -Wall
-Wextra -Wimplicit-fallthrough -Wunreachable-code -Wthread-safety -Wextra-semi
-Wno-missing-field-initializers -Wno-unused-parameter -Wno-c++11-narrowing
-Wno-unneeded-internal-declaration -Wno-undefined-var-template -Wno-ignored-pragma-optimize
-Wno-implicit-int-float-conversion -Wno-final-dtor-non-final-class
-Wno-builtin-assume-aligned-alignment -Wno-deprecated-copy -Wno-pointer-to-int-cast
-fno-omit-frame-pointer -momit-leaf-frame-pointer -g0 -fvisibility=hidden
-Wheader-hygiene -Wstring-conversion -Wtautological-overlap-compare
-Wmissing-field-initializers -Wunreachable-code -O3 -fno-ident -fdata-sections
-ffunction-sections -Wexit-time-destructors -std=c++14 -fno-exceptions -fno-rtti
-fvisibility-inlines-hidden -c ../../v8/src/interpreter/bytecode-generator.cc -o
obj/v8/v8_base_without_compiler/bytecode-generator.o
[39704/40379] clang++ -MMD -MF obj/v8/v8_base_without_compiler/interpreter.o.d
-DUSE_UDEV -DUSE_AURA=1 -DUSE_GLIB=1 -DUSE_NSS_CERTS=1 -DUSE_X11=1 -DOFFICIAL_BUILD
-D_FILE_OFFSET_BITS=64 -D_LARGEFILE_SOURCE -D_LARGEFILE64_SOURCE -DNO_UNWIND_TABLES
-D_GNU_SOURCE -D__STDC_CONSTANT_MACROS -D__STDC_FORMAT_MACROS -D_FORTIFY_SOURCE=2 -DNDEBUG
-DNVALGRIND -DDYNAMIC_ANNOTATIONS_ENABLED=0 -DV8_TYPED_ARRAY_MAX_SIZE_IN_HEAP=64
-DENABLE_MINOR_MC -DV8_INTL_SUPPORT -DV8_USE_EXTERNAL_STARTUP_DATA
-DV8_CONCURRENT_MARKING -DV8_ARRAY_BUFFER_EXTENSION -DV8_ENABLE_LAZY_SOURCE_POSITIONS
-DV8_EMBEDDED_BUILTINS -DV8_SHARED_RO_HEAP -DV8_WIN64_UNWINDING_INFO
-DV8_ENABLE_REGEXP_INTERPRETER_THREADED_DISPATCH -DV8_SNAPSHOT_COMPRESSION
-DV8_DEPRECATION_WARNINGS -DV8_TARGET_ARCH_IA32 -DV8_HAVE_TARGET_OS
-DV8_TARGET_OS_LINUX -DDISABLE_UNTRUSTED_CODE_MITIGATIONS -DV8_DEPRECATION_WARNINGS
-DU_USING_ICU_NAMESPACE=0 -DU_ENABLE_DYLOAD=0 -DUSE_CHROMIUM_ICU=1
-DU_ENABLE_TRACING=1 -DU_ENABLE_RESOURCE_TRACING=0 -DU_STATIC_IMPLEMENTATION
-DICU_UTIL_DATA_IMPL=ICU_UTIL_DATA_FILE -DUCHAR_TYPE=uint16_t -DV8_DEPRECATION_WARNINGS
-I../.. -Igen -I../../v8 -Igen/v8 -I../../third_party/icu/source/common
-I../../third_party/icu/source/i18n -I../../v8/include -I../../third_party/zlib
-fprofile-sample-use=../../chrome/android/profiles/afdo.prof -fno-strict-aliasing
--param=ssp-buffer-size=4 -fstack-protector -fno-unwind-tables
-fno-asynchronous-unwind-tables -fPIC -pthread -fcolor-diagnostics
-fmerge-all-constants -fcrash-diagnostics-dir=../../tools/clang/crashreports
-Xclang -mllvm -Xclang -instcombine-lower-dbg-declare=0 -m32 -msse2 -mfpmath=sse
-mmmx -Xclang -fdebug-compilation-dir -Xclang . -no-canonical-prefixes -Wall
-Wextra -Wimplicit-fallthrough -Wunreachable-code -Wthread-safety -Wextra-semi
-Wno-missing-field-initializers -Wno-unused-parameter -Wno-c++11-narrowing
-Wno-unneeded-internal-declaration -Wno-undefined-var-template -Wno-ignored-pragma-optimize
-Wno-implicit-int-float-conversion -Wno-final-dtor-non-final-class
-Wno-builtin-assume-aligned-alignment -Wno-deprecated-copy -Wno-pointer-to-int-cast
-fno-omit-frame-pointer -momit-leaf-frame-pointer -g0 -fvisibility=hidden -Wheader-hygiene
-Wstring-conversion -Wtautological-overlap-compare -Wmissing-field-initializers
-Wunreachable-code -O3 -fno-ident -fdata-sections -ffunction-sections
-Wexit-time-destructors -std=c++14 -fno-exceptions -fno-rtti -fvisibility-inlines-hidden
-c ../../v8/src/interpreter/interpreter.cc -o obj/v8/v8_base_without_compiler/interpreter.o
[39705/40379] clang++ -MMD -MF obj/v8/v8_base_without_compiler/counters.o.d
-DUSE_UDEV -DUSE_AURA=1 -DUSE_GLIB=1 -DUSE_NSS_CERTS=1 -DUSE_X11=1 -DOFFICIAL_BUILD
-D_FILE_OFFSET_BITS=64 -D_LARGEFILE_SOURCE -D_LARGEFILE64_SOURCE -DNO_UNWIND_TABLES
-D_GNU_SOURCE -D__STDC_CONSTANT_MACROS -D__STDC_FORMAT_MACROS -D_FORTIFY_SOURCE=2 -DNDEBUG
-DNVALGRIND -DDYNAMIC_ANNOTATIONS_ENABLED=0 -DV8_TYPED_ARRAY_MAX_SIZE_IN_HEAP=64
-DENABLE_MINOR_MC -DV8_INTL_SUPPORT -DV8_USE_EXTERNAL_STARTUP_DATA
-DV8_CONCURRENT_MARKING -DV8_ARRAY_BUFFER_EXTENSION -DV8_ENABLE_LAZY_SOURCE_POSITIONS
-DV8_EMBEDDED_BUILTINS -DV8_SHARED_RO_HEAP -DV8_WIN64_UNWINDING_INFO
-DV8_ENABLE_REGEXP_INTERPRETER_THREADED_DISPATCH -DV8_SNAPSHOT_COMPRESSION
-DV8_DEPRECATION_WARNINGS -DV8_TARGET_ARCH_IA32 -DV8_HAVE_TARGET_OS
-DV8_TARGET_OS_LINUX -DDISABLE_UNTRUSTED_CODE_MITIGATIONS -DV8_DEPRECATION_WARNINGS
-DU_USING_ICU_NAMESPACE=0 -DU_ENABLE_DYLOAD=0 -DUSE_CHROMIUM_ICU=1
-DU_ENABLE_TRACING=1 -DU_ENABLE_RESOURCE_TRACING=0 -DU_STATIC_IMPLEMENTATION
-DICU_UTIL_DATA_IMPL=ICU_UTIL_DATA_FILE -DUCHAR_TYPE=uint16_t -DV8_DEPRECATION_WARNINGS
-I../.. -Igen -I../../v8 -Igen/v8 -I../../third_party/icu/source/common
-I../../third_party/icu/source/i18n -I../../v8/include -I../../third_party/zlib
-fprofile-sample-use=../../chrome/android/profiles/afdo.prof -fno-strict-aliasing
--param=ssp-buffer-size=4 -fstack-protector -fno-unwind-tables
-fno-asynchronous-unwind-tables -fPIC -pthread -fcolor-diagnostics
-fmerge-all-constants -fcrash-diagnostics-dir=../../tools/clang/crashreports
-Xclang -mllvm -Xclang -instcombine-lower-dbg-declare=0 -m32 -msse2 -mfpmath=sse
-mmmx -Xclang -fdebug-compilation-dir -Xclang . -no-canonical-prefixes -Wall
-Wextra -Wimplicit-fallthrough -Wunreachable-code -Wthread-safety -Wextra-semi
-Wno-missing-field-initializers -Wno-unused-parameter -Wno-c++11-narrowing
-Wno-unneeded-internal-declaration -Wno-undefined-var-template -Wno-ignored-pragma-optimize
-Wno-implicit-int-float-conversion -Wno-final-dtor-non-final-class
-Wno-builtin-assume-aligned-alignment -Wno-deprecated-copy -Wno-pointer-to-int-cast
-fno-omit-frame-pointer -momit-leaf-frame-pointer -g0 -fvisibility=hidden -Wheader-hygiene
-Wstring-conversion -Wtautological-overlap-compare -Wmissing-field-initializers
-Wunreachable-code -O3 -fno-ident -fdata-sections -ffunction-sections
-Wexit-time-destructors -std=c++14 -fno-exceptions -fno-rtti -fvisibility-inlines-hidden
-c ../../v8/src/logging/counters.cc -o obj/v8/v8_base_without_compiler/counters.o
[39706/40379] clang++ -MMD -MF obj/v8/v8_base_without_compiler/json-stringifier.o.d
-DUSE_UDEV -DUSE_AURA=1 -DUSE_GLIB=1 -DUSE_NSS_CERTS=1 -DUSE_X11=1 -DOFFICIAL_BUILD
-D_FILE_OFFSET_BITS=64 -D_LARGEFILE_SOURCE -D_LARGEFILE64_SOURCE -DNO_UNWIND_TABLES
-D_GNU_SOURCE -D__STDC_CONSTANT_MACROS -D__STDC_FORMAT_MACROS -D_FORTIFY_SOURCE=2 -DNDEBUG
-DNVALGRIND -DDYNAMIC_ANNOTATIONS_ENABLED=0 -DV8_TYPED_ARRAY_MAX_SIZE_IN_HEAP=64
-DENABLE_MINOR_MC -DV8_INTL_SUPPORT -DV8_USE_EXTERNAL_STARTUP_DATA
-DV8_CONCURRENT_MARKING -DV8_ARRAY_BUFFER_EXTENSION -DV8_ENABLE_LAZY_SOURCE_POSITIONS
-DV8_EMBEDDED_BUILTINS -DV8_SHARED_RO_HEAP -DV8_WIN64_UNWINDING_INFO
-DV8_ENABLE_REGEXP_INTERPRETER_THREADED_DISPATCH -DV8_SNAPSHOT_COMPRESSION
-DV8_DEPRECATION_WARNINGS -DV8_TARGET_ARCH_IA32 -DV8_HAVE_TARGET_OS
-DV8_TARGET_OS_LINUX -DDISABLE_UNTRUSTED_CODE_MITIGATIONS -DV8_DEPRECATION_WARNINGS
-DU_USING_ICU_NAMESPACE=0 -DU_ENABLE_DYLOAD=0 -DUSE_CHROMIUM_ICU=1
-DU_ENABLE_TRACING=1 -DU_ENABLE_RESOURCE_TRACING=0 -DU_STATIC_IMPLEMENTATION
-DICU_UTIL_DATA_IMPL=ICU_UTIL_DATA_FILE -DUCHAR_TYPE=uint16_t -DV8_DEPRECATION_WARNINGS
-I../.. -Igen -I../../v8 -Igen/v8 -I../../third_party/icu/source/common
-I../../third_party/icu/source/i18n -I../../v8/include -I../../third_party/zlib
-fprofile-sample-use=../../chrome/android/profiles/afdo.prof -fno-strict-aliasing
--param=ssp-buffer-size=4 -fstack-protector -fno-unwind-tables
-fno-asynchronous-unwind-tables -fPIC -pthread -fcolor-diagnostics
-fmerge-all-constants -fcrash-diagnostics-dir=../../tools/clang/crashreports
-Xclang -mllvm -Xclang -instcombine-lower-dbg-declare=0 -m32 -msse2 -mfpmath=sse
-mmmx -Xclang -fdebug-compilation-dir -Xclang . -no-canonical-prefixes -Wall
-Wextra -Wimplicit-fallthrough -Wunreachable-code -Wthread-safety -Wextra-semi
-Wno-missing-field-initializers -Wno-unused-parameter -Wno-c++11-narrowing
-Wno-unneeded-internal-declaration -Wno-undefined-var-template -Wno-ignored-pragma-optimize
-Wno-implicit-int-float-conversion -Wno-final-dtor-non-final-class
-Wno-builtin-assume-aligned-alignment -Wno-deprecated-copy -Wno-pointer-to-int-cast
-fno-omit-frame-pointer -momit-leaf-frame-pointer -g0 -fvisibility=hidden -Wheader-hygiene
-Wstring-conversion -Wtautological-overlap-compare -Wmissing-field-initializers
-Wunreachable-code -O3 -fno-ident -fdata-sections -ffunction-sections
-Wexit-time-destructors -std=c++14 -fno-exceptions -fno-rtti -fvisibility-inlines-hidden -c
../../v8/src/json/json-stringifier.cc -o obj/v8/v8_base_without_compiler/json-stringifier.o
[39707/40379] clang++ -MMD -MF obj/v8/v8_base_without_compiler/json-parser.o.d
-DUSE_UDEV -DUSE_AURA=1 -DUSE_GLIB=1 -DUSE_NSS_CERTS=1 -DUSE_X11=1 -DOFFICIAL_BUILD
-D_FILE_OFFSET_BITS=64 -D_LARGEFILE_SOURCE -D_LARGEFILE64_SOURCE -DNO_UNWIND_TABLES
-D_GNU_SOURCE -D__STDC_CONSTANT_MACROS -D__STDC_FORMAT_MACROS -D_FORTIFY_SOURCE=2 -DNDEBUG
-DNVALGRIND -DDYNAMIC_ANNOTATIONS_ENABLED=0 -DV8_TYPED_ARRAY_MAX_SIZE_IN_HEAP=64
-DENABLE_MINOR_MC -DV8_INTL_SUPPORT -DV8_USE_EXTERNAL_STARTUP_DATA
-DV8_CONCURRENT_MARKING -DV8_ARRAY_BUFFER_EXTENSION -DV8_ENABLE_LAZY_SOURCE_POSITIONS
-DV8_EMBEDDED_BUILTINS -DV8_SHARED_RO_HEAP -DV8_WIN64_UNWINDING_INFO
-DV8_ENABLE_REGEXP_INTERPRETER_THREADED_DISPATCH -DV8_SNAPSHOT_COMPRESSION
-DV8_DEPRECATION_WARNINGS -DV8_TARGET_ARCH_IA32 -DV8_HAVE_TARGET_OS
-DV8_TARGET_OS_LINUX -DDISABLE_UNTRUSTED_CODE_MITIGATIONS -DV8_DEPRECATION_WARNINGS
-DU_USING_ICU_NAMESPACE=0 -DU_ENABLE_DYLOAD=0 -DUSE_CHROMIUM_ICU=1
-DU_ENABLE_TRACING=1 -DU_ENABLE_RESOURCE_TRACING=0 -DU_STATIC_IMPLEMENTATION
-DICU_UTIL_DATA_IMPL=ICU_UTIL_DATA_FILE -DUCHAR_TYPE=uint16_t -DV8_DEPRECATION_WARNINGS
-I../.. -Igen -I../../v8 -Igen/v8 -I../../third_party/icu/source/common
-I../../third_party/icu/source/i18n -I../../v8/include -I../../third_party/zlib
-fprofile-sample-use=../../chrome/android/profiles/afdo.prof -fno-strict-aliasing
--param=ssp-buffer-size=4 -fstack-protector -fno-unwind-tables
-fno-asynchronous-unwind-tables -fPIC -pthread -fcolor-diagnostics
-fmerge-all-constants -fcrash-diagnostics-dir=../../tools/clang/crashreports
-Xclang -mllvm -Xclang -instcombine-lower-dbg-declare=0 -m32 -msse2 -mfpmath=sse
-mmmx -Xclang -fdebug-compilation-dir -Xclang . -no-canonical-prefixes -Wall
-Wextra -Wimplicit-fallthrough -Wunreachable-code -Wthread-safety -Wextra-semi
-Wno-missing-field-initializers -Wno-unused-parameter -Wno-c++11-narrowing
-Wno-unneeded-internal-declaration -Wno-undefined-var-template -Wno-ignored-pragma-optimize
-Wno-implicit-int-float-conversion -Wno-final-dtor-non-final-class
-Wno-builtin-assume-aligned-alignment -Wno-deprecated-copy -Wno-pointer-to-int-cast
-fno-omit-frame-pointer -momit-leaf-frame-pointer -g0 -fvisibility=hidden -Wheader-hygiene
-Wstring-conversion -Wtautological-overlap-compare -Wmissing-field-initializers
-Wunreachable-code -O3 -fno-ident -fdata-sections -ffunction-sections
-Wexit-time-destructors -std=c++14 -fno-exceptions -fno-rtti -fvisibility-inlines-hidden
-c ../../v8/src/json/json-parser.cc -o obj/v8/v8_base_without_compiler/json-parser.o
[39708/40379] clang++ -MMD -MF obj/v8/v8_base_without_compiler/log-utils.o.d
-DUSE_UDEV -DUSE_AURA=1 -DUSE_GLIB=1 -DUSE_NSS_CERTS=1 -DUSE_X11=1 -DOFFICIAL_BUILD
-D_FILE_OFFSET_BITS=64 -D_LARGEFILE_SOURCE -D_LARGEFILE64_SOURCE -DNO_UNWIND_TABLES
-D_GNU_SOURCE -D__STDC_CONSTANT_MACROS -D__STDC_FORMAT_MACROS -D_FORTIFY_SOURCE=2 -DNDEBUG
-DNVALGRIND -DDYNAMIC_ANNOTATIONS_ENABLED=0 -DV8_TYPED_ARRAY_MAX_SIZE_IN_HEAP=64
-DENABLE_MINOR_MC -DV8_INTL_SUPPORT -DV8_USE_EXTERNAL_STARTUP_DATA
-DV8_CONCURRENT_MARKING -DV8_ARRAY_BUFFER_EXTENSION -DV8_ENABLE_LAZY_SOURCE_POSITIONS
-DV8_EMBEDDED_BUILTINS -DV8_SHARED_RO_HEAP -DV8_WIN64_UNWINDING_INFO
-DV8_ENABLE_REGEXP_INTERPRETER_THREADED_DISPATCH -DV8_SNAPSHOT_COMPRESSION
-DV8_DEPRECATION_WARNINGS -DV8_TARGET_ARCH_IA32 -DV8_HAVE_TARGET_OS
-DV8_TARGET_OS_LINUX -DDISABLE_UNTRUSTED_CODE_MITIGATIONS -DV8_DEPRECATION_WARNINGS
-DU_USING_ICU_NAMESPACE=0 -DU_ENABLE_DYLOAD=0 -DUSE_CHROMIUM_ICU=1
-DU_ENABLE_TRACING=1 -DU_ENABLE_RESOURCE_TRACING=0 -DU_STATIC_IMPLEMENTATION
-DICU_UTIL_DATA_IMPL=ICU_UTIL_DATA_FILE -DUCHAR_TYPE=uint16_t -DV8_DEPRECATION_WARNINGS
-I../.. -Igen -I../../v8 -Igen/v8 -I../../third_party/icu/source/common
-I../../third_party/icu/source/i18n -I../../v8/include -I../../third_party/zlib
-fprofile-sample-use=../../chrome/android/profiles/afdo.prof -fno-strict-aliasing
--param=ssp-buffer-size=4 -fstack-protector -fno-unwind-tables
-fno-asynchronous-unwind-tables -fPIC -pthread -fcolor-diagnostics
-fmerge-all-constants -fcrash-diagnostics-dir=../../tools/clang/crashreports
-Xclang -mllvm -Xclang -instcombine-lower-dbg-declare=0 -m32 -msse2 -mfpmath=sse
-mmmx -Xclang -fdebug-compilation-dir -Xclang . -no-canonical-prefixes -Wall
-Wextra -Wimplicit-fallthrough -Wunreachable-code -Wthread-safety -Wextra-semi
-Wno-missing-field-initializers -Wno-unused-parameter -Wno-c++11-narrowing
-Wno-unneeded-internal-declaration -Wno-undefined-var-template -Wno-ignored-pragma-optimize
-Wno-implicit-int-float-conversion -Wno-final-dtor-non-final-class
-Wno-builtin-assume-aligned-alignment -Wno-deprecated-copy -Wno-pointer-to-int-cast
-fno-omit-frame-pointer -momit-leaf-frame-pointer -g0 -fvisibility=hidden -Wheader-hygiene
-Wstring-conversion -Wtautological-overlap-compare -Wmissing-field-initializers
-Wunreachable-code -O3 -fno-ident -fdata-sections -ffunction-sections
-Wexit-time-destructors -std=c++14 -fno-exceptions -fno-rtti -fvisibility-inlines-hidden
-c ../../v8/src/logging/log-utils.cc -o obj/v8/v8_base_without_compiler/log-utils.o
[39709/40379] clang++ -MMD -MF obj/v8/v8_base_without_compiler/source-range-ast-visitor.o.d
-DUSE_UDEV -DUSE_AURA=1 -DUSE_GLIB=1 -DUSE_NSS_CERTS=1 -DUSE_X11=1 -DOFFICIAL_BUILD
-D_FILE_OFFSET_BITS=64 -D_LARGEFILE_SOURCE -D_LARGEFILE64_SOURCE -DNO_UNWIND_TABLES
-D_GNU_SOURCE -D__STDC_CONSTANT_MACROS -D__STDC_FORMAT_MACROS -D_FORTIFY_SOURCE=2 -DNDEBUG
-DNVALGRIND -DDYNAMIC_ANNOTATIONS_ENABLED=0 -DV8_TYPED_ARRAY_MAX_SIZE_IN_HEAP=64
-DENABLE_MINOR_MC -DV8_INTL_SUPPORT -DV8_USE_EXTERNAL_STARTUP_DATA
-DV8_CONCURRENT_MARKING -DV8_ARRAY_BUFFER_EXTENSION -DV8_ENABLE_LAZY_SOURCE_POSITIONS
-DV8_EMBEDDED_BUILTINS -DV8_SHARED_RO_HEAP -DV8_WIN64_UNWINDING_INFO
-DV8_ENABLE_REGEXP_INTERPRETER_THREADED_DISPATCH -DV8_SNAPSHOT_COMPRESSION
-DV8_DEPRECATION_WARNINGS -DV8_TARGET_ARCH_IA32 -DV8_HAVE_TARGET_OS
-DV8_TARGET_OS_LINUX -DDISABLE_UNTRUSTED_CODE_MITIGATIONS -DV8_DEPRECATION_WARNINGS
-DU_USING_ICU_NAMESPACE=0 -DU_ENABLE_DYLOAD=0 -DUSE_CHROMIUM_ICU=1
-DU_ENABLE_TRACING=1 -DU_ENABLE_RESOURCE_TRACING=0 -DU_STATIC_IMPLEMENTATION
-DICU_UTIL_DATA_IMPL=ICU_UTIL_DATA_FILE -DUCHAR_TYPE=uint16_t -DV8_DEPRECATION_WARNINGS
-I../.. -Igen -I../../v8 -Igen/v8 -I../../third_party/icu/source/common
-I../../third_party/icu/source/i18n -I../../v8/include -I../../third_party/zlib
-fprofile-sample-use=../../chrome/android/profiles/afdo.prof -fno-strict-aliasing
--param=ssp-buffer-size=4 -fstack-protector -fno-unwind-tables
-fno-asynchronous-unwind-tables -fPIC -pthread -fcolor-diagnostics
-fmerge-all-constants -fcrash-diagnostics-dir=../../tools/clang/crashreports
-Xclang -mllvm -Xclang -instcombine-lower-dbg-declare=0 -m32 -msse2 -mfpmath=sse
-mmmx -Xclang -fdebug-compilation-dir -Xclang . -no-canonical-prefixes -Wall
-Wextra -Wimplicit-fallthrough -Wunreachable-code -Wthread-safety -Wextra-semi
-Wno-missing-field-initializers -Wno-unused-parameter -Wno-c++11-narrowing
-Wno-unneeded-internal-declaration -Wno-undefined-var-template -Wno-ignored-pragma-optimize
-Wno-implicit-int-float-conversion -Wno-final-dtor-non-final-class
-Wno-builtin-assume-aligned-alignment -Wno-deprecated-copy -Wno-pointer-to-int-cast
-fno-omit-frame-pointer -momit-leaf-frame-pointer -g0 -fvisibility=hidden
-Wheader-hygiene -Wstring-conversion -Wtautological-overlap-compare
-Wmissing-field-initializers -Wunreachable-code -O3 -fno-ident -fdata-sections
-ffunction-sections -Wexit-time-destructors -std=c++14 -fno-exceptions -fno-rtti
-fvisibility-inlines-hidden -c ../../v8/src/ast/source-range-ast-visitor.cc -o
obj/v8/v8_base_without_compiler/source-range-ast-visitor.o
[39710/40379] clang++ -MMD -MF obj/v8/v8_base_without_compiler/modules.o.d
-DUSE_UDEV -DUSE_AURA=1 -DUSE_GLIB=1 -DUSE_NSS_CERTS=1 -DUSE_X11=1 -DOFFICIAL_BUILD
-D_FILE_OFFSET_BITS=64 -D_LARGEFILE_SOURCE -D_LARGEFILE64_SOURCE -DNO_UNWIND_TABLES
-D_GNU_SOURCE -D__STDC_CONSTANT_MACROS -D__STDC_FORMAT_MACROS -D_FORTIFY_SOURCE=2 -DNDEBUG
-DNVALGRIND -DDYNAMIC_ANNOTATIONS_ENABLED=0 -DV8_TYPED_ARRAY_MAX_SIZE_IN_HEAP=64
-DENABLE_MINOR_MC -DV8_INTL_SUPPORT -DV8_USE_EXTERNAL_STARTUP_DATA
-DV8_CONCURRENT_MARKING -DV8_ARRAY_BUFFER_EXTENSION -DV8_ENABLE_LAZY_SOURCE_POSITIONS
-DV8_EMBEDDED_BUILTINS -DV8_SHARED_RO_HEAP -DV8_WIN64_UNWINDING_INFO
-DV8_ENABLE_REGEXP_INTERPRETER_THREADED_DISPATCH -DV8_SNAPSHOT_COMPRESSION
-DV8_DEPRECATION_WARNINGS -DV8_TARGET_ARCH_IA32 -DV8_HAVE_TARGET_OS
-DV8_TARGET_OS_LINUX -DDISABLE_UNTRUSTED_CODE_MITIGATIONS -DV8_DEPRECATION_WARNINGS
-DU_USING_ICU_NAMESPACE=0 -DU_ENABLE_DYLOAD=0 -DUSE_CHROMIUM_ICU=1
-DU_ENABLE_TRACING=1 -DU_ENABLE_RESOURCE_TRACING=0 -DU_STATIC_IMPLEMENTATION
-DICU_UTIL_DATA_IMPL=ICU_UTIL_DATA_FILE -DUCHAR_TYPE=uint16_t -DV8_DEPRECATION_WARNINGS
-I../.. -Igen -I../../v8 -Igen/v8 -I../../third_party/icu/source/common
-I../../third_party/icu/source/i18n -I../../v8/include -I../../third_party/zlib
-fprofile-sample-use=../../chrome/android/profiles/afdo.prof -fno-strict-aliasing
--param=ssp-buffer-size=4 -fstack-protector -fno-unwind-tables
-fno-asynchronous-unwind-tables -fPIC -pthread -fcolor-diagnostics
-fmerge-all-constants -fcrash-diagnostics-dir=../../tools/clang/crashreports
-Xclang -mllvm -Xclang -instcombine-lower-dbg-declare=0 -m32 -msse2 -mfpmath=sse
-mmmx -Xclang -fdebug-compilation-dir -Xclang . -no-canonical-prefixes -Wall
-Wextra -Wimplicit-fallthrough -Wunreachable-code -Wthread-safety -Wextra-semi
-Wno-missing-field-initializers -Wno-unused-parameter -Wno-c++11-narrowing
-Wno-unneeded-internal-declaration -Wno-undefined-var-template -Wno-ignored-pragma-optimize
-Wno-implicit-int-float-conversion -Wno-final-dtor-non-final-class
-Wno-builtin-assume-aligned-alignment -Wno-deprecated-copy -Wno-pointer-to-int-cast
-fno-omit-frame-pointer -momit-leaf-frame-pointer -g0 -fvisibility=hidden -Wheader-hygiene
-Wstring-conversion -Wtautological-overlap-compare -Wmissing-field-initializers
-Wunreachable-code -O3 -fno-ident -fdata-sections -ffunction-sections
-Wexit-time-destructors -std=c++14 -fno-exceptions -fno-rtti -fvisibility-inlines-hidden
-c ../../v8/src/ast/modules.cc -o obj/v8/v8_base_without_compiler/modules.o
hasher-priv: master: time elapsed limit (28800 seconds) exceeded
clamav-0.102.4-alt1
make[3]: Entering directory '/usr/src/RPM/BUILD/clamav-0.102.4/unit_tests'
FAIL: check_clamav
PASS: check_freshclam.sh
--
# SKIP: 6
# XFAIL: 0
# FAIL: 1
# XPASS: 0
# ERROR: 0
See unit_tests/test-suite.log
compiz-0.9.14.1-alt1
make[1]: Entering directory '/usr/src/RPM/BUILD/compiz-0.9.14.1/i586-alt-linux'
[ 16%] Built target compiz_string
make[1]: Leaving directory '/usr/src/RPM/BUILD/compiz-0.9.14.1/i586-alt-linux'
make[2]: Entering directory '/usr/src/RPM/BUILD/compiz-0.9.14.1/i586-alt-linux'
[ 1%] Generating ../../po/compiz.pot
make[2]: Leaving directory '/usr/src/RPM/BUILD/compiz-0.9.14.1/i586-alt-linux'
make[1]: Entering directory '/usr/src/RPM/BUILD/compiz-0.9.14.1/i586-alt-linux'
[ 16%] Built target nls
make[1]: Leaving directory '/usr/src/RPM/BUILD/compiz-0.9.14.1/i586-alt-linux'
make: *** [Makefile:163: all] Error 2
custodia-0.6.0-alt6
self.fail(str(exc))
E AssertionError: HTTPSConnectionPool(host='localhost', port=44673): Max retries
exceeded with url: /forwarder/test/ (Caused by SSLError(SSLError(1, '[SSL] tlsv13 alert
certificate required (_ssl.c:2508)')))
==================== 1 failed, 161 passed in 77.61 seconds =====================
ERROR: InvocationError for command /usr/src/RPM/BUILD/custodia-0.6.0/.tox/py37/bin/python
-m coverage run --parallel -m pytest --capture=no --strict (exited with code 1)
ERROR: invocation failed (exit code 1)
✖ FAIL py37 in 1 minute, 38.371 seconds
___________________________________ summary ____________________________________
ERROR: py37: parallel child exit code 1
erlang-proper-1.3-alt2
DEBUG: No processes to kill
ERROR: One or more eunit tests failed.
ERROR: eunit failed while processing /usr/src/RPM/BUILD/erlang-proper-1.3: rebar_abort
gnutls30-3.6.15-alt1
# SKIP: 17
# XFAIL: 0
# FAIL: 0
# XPASS: 0
# ERROR: 0
make[3]: Leaving directory '/usr/src/RPM/BUILD/gnutls-3.6.15/fuzz'
--
# SKIP: 0
# XFAIL: 0
# FAIL: 0
# XPASS: 0
# ERROR: 0
make[4]: Leaving directory '/usr/src/RPM/BUILD/gnutls-3.6.15/guile'
lazarus-1:2.0.10-alt3
(1008) 1766 строк скомпилиpовано, 1.4 сек.
(1021) 2 предупреждений
(1022) 44 подсказок
Hint: (lazarus) [RunTool] "/usr/bin/fpc" "-iWTOTP"
Hint: (lazarus) [RunTool] "/usr/bin/fpc" "-va" "-Fr/usr/lib/fpc/msg/errore.msg"
"compilertest.paAn unhandled exception occurred at $31373435:
EAccessViolation: Access violation
$31373435
$08581667 TEXTERNALTOOLTHREAD__SETTOOL, line 1323 of exttools.pas
$0858266D TEXTERNALTOOLTHREAD__DESTROY, line 1622 of exttools.pas
$08065AC6
mpc-0.30-alt1
[21/22] Generating HTML documentation with a custom command.
FAILED: doc/html
/usr/bin/sphinx-build-3 -q -b html -d doc/doctrees /usr/src/RPM/BUILD/mpc-0.30/doc doc/html
--
doctree = pickle.load(f)
EOFError: Ran out of input
The full traceback has been saved in /usr/src/tmp/sphinx-err-3ujlul08.log, if you want
to report the issue to the developers.
ncmpc-0.31-alt1
[76/77] Generating HTML documentation with a custom command.
FAILED: doc/html
/usr/bin/sphinx-build-3 -q -b html -d doc/doctrees /usr/src/RPM/BUILD/ncmpc-0.31/doc
doc/html
--
doctree = pickle.load(f)
_pickle.UnpicklingError: pickle data was truncated
The full traceback has been saved in /usr/src/tmp/sphinx-err-g9gmxzyh.log, if you want
to report the issue to the developers.
openldap-2.4.54-alt0.M90P.1
Waiting 20 seconds for lockout to reset...
Testing password expiration
Waiting 20 seconds for password to expire...
Password expiration test failed
>>>>> test022-ppolicy failed for mdb
(exit 1)
make[2]: *** [Makefile:309: mdb-yes] Error 1
make[2]: Leaving directory '/usr/src/RPM/BUILD/openldap-2.4.54/tests'
make[1]: *** [Makefile:280: test] Error 2
make: *** [Makefile:290: test] Error 2
python-module-Pyro4-4.75-alt1
............................................................................................................................................................ss............................s........ss............................s.......................................sss.s.....s.....s.................s.......s............................s........ss................................................................................F...F...F....................................E..........F.......F.........................................................
ERROR: testGeneratorLinger (PyroTests.test_server.ServerTestsThreadNoTimeout)
Traceback (most recent call last):
--
raise err
ConnectionClosedError: receiving: not enough data
FAIL: testServerParallelism (PyroTests.test_server.ServerTestsMultiplexNoTimeout)
Traceback (most recent call last):
--
self.assertTrue(2.5 < duration < 3.5)
AssertionError: False is not true
FAIL: testAsyncProxyCallchain (PyroTests.test_server.ServerTestsOnce)
Traceback (most recent call last):
--
self.assertTrue(duration < 0.1)
AssertionError: False is not true
FAIL: testBatchOneway (PyroTests.test_server.ServerTestsOnce)
Traceback (most recent call last):
--
self.assertTrue(duration < 0.1, "oneway batch with delay should return almost immediately")
AssertionError: oneway batch with delay should return almost immediately
FAIL: testServerParallelism (PyroTests.test_server.ServerTestsThreadNoTimeout)
Traceback (most recent call last):
--
self.assertTrue(0.4 < duration < 0.9)
AssertionError: False is not true
FAIL: testOnewayDelayed (PyroTests.test_server_timeout.ServerTestsMultiplexTimeout)
python-module-dbusmock-0.18.3-alt1
test_default_timezone (test_timedated.TestTimedated) ... SKIP: timedatectl not installed
(upower:2597262): UPower-WARNING **: 10:48:56.405: Cannot connect to upowerd: Could
not connect: No such file or directory
test_charging_battery (test_upower.TestUPower) ... ok
--
test_subobjects (test_urfkill.TestURfkill) ... ok
FAIL: test_one_ac (test_upower.TestUPower)
Traceback (most recent call last):
--
raise self.failureException('%r not found in %s' % (pattern, value))
AssertionError: u'device changed:\\s+/org/freedesktop/UPower/devices/mock_AC' not found
in Monitoring activity from the power daemon. Press Ctrl+C to cancel.
Ran 114 tests in 217.112s
FAILED (failures=1, skipped=35)
Test failed: <unittest.runner.TextTestResult run=114 errors=0 failures=1>
error: Test failed: <unittest.runner.TextTestResult run=114 errors=0 failures=1>
sgc-0.2.1-alt3
+ xvfb-run sh makedocs
_XSERVTransmkdir: ERROR: euid != 0,directory /tmp/.X11-unix will not be created.
The XKEYBOARD keymap compiler (xkbcomp) reports:
--
pygame.display.init()
error: Couldn't open X11 display
The full traceback has been saved in /usr/src/tmp/sphinx-err-SmQFzi.log, if you want
to report the issue to the developers.
vi-traditional-050325-alt1
/usr/bin/ld.default: cannot find -luxre
collect2: error: ld returned 1 exit status
make: *** [Makefile:267: ex] Error 1
8 error logs REMOVED from the list
chromium-84.0.4147.105-alt1.1.p9
cilk-5.4.6-alt11
glibc-6:2.27-alt12
gprolog-1.4.4-alt2
gst-plugins-bad1.0-1.16.1-alt2
libgtk4-3.96.0-alt1
libical-3.0.6-alt1
subethasmtp-3.1.7-alt1_12jpp8
Total 136 error logs.
^ permalink raw reply [flat|nested] only message in thread
only message in thread, other threads:[~2020-11-29 13:46 UTC | newest]
Thread overview: (only message) (download: mbox.gz / follow: Atom feed)
-- links below jump to the message on this page --
2020-11-29 13:46 [cyber] I: p9-20201129 i586 beehive_status: +15 -8 (136) ALT beekeeper
ALT Linux Sisyphus cybertalk
This inbox may be cloned and mirrored by anyone:
git clone --mirror http://lore.altlinux.org/sisyphus-cybertalk/0 sisyphus-cybertalk/git/0.git
# If you have public-inbox 1.1+ installed, you may
# initialize and index your mirror using the following commands:
public-inbox-init -V2 sisyphus-cybertalk sisyphus-cybertalk/ http://lore.altlinux.org/sisyphus-cybertalk \
sisyphus-cybertalk@lists.altlinux.org sisyphus-cybertalk@lists.altlinux.ru sisyphus-cybertalk@lists.altlinux.com
public-inbox-index sisyphus-cybertalk
Example config snippet for mirrors.
Newsgroup available over NNTP:
nntp://lore.altlinux.org/org.altlinux.lists.sisyphus-cybertalk
AGPL code for this site: git clone https://public-inbox.org/public-inbox.git