ALT Linux Sisyphus cybertalk
 help / color / mirror / Atom feed
* [cyber] I: t6-20111016 x86_64 beehive_status: +18 -12 (162)
@ 2011-10-16 15:06 ALT beekeeper
  0 siblings, 0 replies; only message in thread
From: ALT beekeeper @ 2011-10-16 15:06 UTC (permalink / raw)
  To: sisyphus-cybertalk

	18 NEW error logs

389-admin-console-1.1.7-alt1
	[javac] 1 error
	BUILD FAILED
	/usr/src/RPM/BUILD/389-admin-console-1.1.7/build.xml:102: Compile failed; see the
	compiler error output for details.

fonts-ttf-apanov-edrip-20100430-alt2_2
	MI2a:	mark python-module-fontforge
	E: Couldn't find package xgridfit
	hsh-install: Failed to calculate package file list.

fonts-ttf-apanov-heuristica-1:0.2.2-alt2_2
	MI2a:	mark python-module-fontforge
	E: Couldn't find package xgridfit
	hsh-install: Failed to calculate package file list.

fonts-ttf-sil-gentium-basic-1.1-alt2_6
	+ cd Gentium Basic 1.1
	/usr/src/tmp/rpm-tmp.98794: line 97: cd: Gentium: No such file or directory

kernel-modules-dahdi-ovz-el-2.5.0-alt3.132640.37
	+ tar -jxvf /usr/src/kernel/sources/kernel-source-dahdi-2.5.0.tar.bz2
	tar (child): /usr/src/kernel/sources/kernel-source-dahdi-2.5.0.tar.bz2: Cannot open:
	No such file or directory
	tar (child): Error is not recoverable: exiting now

kernel-modules-dahdi-un-def-2.5.0-alt1.196614.1
	+ tar -jxvf /usr/src/kernel/sources/kernel-source-dahdi-2.5.0.tar.bz2
	tar (child): /usr/src/kernel/sources/kernel-source-dahdi-2.5.0.tar.bz2: Cannot open:
	No such file or directory
	tar (child): Error is not recoverable: exiting now

kernel-modules-e1000e-ovz-el-1.2.20-alt1.132640.37
	netdev.c:2308: error: 'struct e1000_ring' has no member named 'name'
	netdev.c:2312: error: 'struct e1000_ring' has no member named 'itr_register'
	netdev.c:2313: error: 'struct e1000_ring' has no member named 'itr_val'
	netdev.c: In function 'e1000_alloc_ring_dma':
	netdev.c:2540: warning: implicit declaration of function 'dma_alloc_coherent'
	netdev.c:2540: error: 'struct e1000_ring' has no member named 'size'
	netdev.c:2540: error: 'struct e1000_ring' has no member named 'dma'
	netdev.c: In function 'e1000e_setup_tx_resources':
	netdev.c:2559: error: 'struct e1000_ring' has no member named 'count'
	netdev.c:2560: error: 'struct e1000_ring' has no member named 'buffer_info'
	netdev.c:2561: error: 'struct e1000_ring' has no member named 'buffer_info'
	netdev.c:2563: error: 'struct e1000_ring' has no member named 'buffer_info'
	netdev.c:2566: error: 'struct e1000_ring' has no member named 'size'

kernel-modules-ipt-netflow-ovz-el-1.0.1.7.1-alt1.132640.37
	MI2a:	  mark cpp4.4
	E: Couldn't find package kernel-source-ipt-netflow
	hsh-install: Failed to calculate package file list.

kernel-modules-lirc-el-smp-1.0.0.8.7-alt1.132640.27
	MI2a:	  mark cpp4.4
	E: Couldn't find package kernel-source-lirc
	hsh-install: Failed to calculate package file list.

kernel-modules-lirc-xen-dom0-1.0.0.8.7-alt1.132640.40
	MI2a:	  mark cpp4.3
	E: Couldn't find package kernel-source-lirc
	hsh-install: Failed to calculate package file list.

kernel-modules-nvidia-un-def-280.13-alt1.196614.1
	<13>Oct 16 14:13:32 rpmi: xorg-drv-vesa-1:2.3.0-alt2 installed
	error: failed build dependencies:
	kernel-source-nvidia-964320 is needed by kernel-modules-nvidia-un-def-280.13-alt1.196614.1

kernel-modules-opendpi-ovz-el-1.3.0-alt1.132640.37
	Selected version kernel-build-tools#0.99.1-alt1 for kernel-build-tools>=0.7
	E: Version ='1.3.0' for 'kernel-source-opendpi' was not found
	hsh-install: Failed to calculate package file list.

kernel-modules-opendpi-un-def-1.3.0-alt1.196614.1
	Selected version kernel-headers-modules-un-def#1:3.0.6-alt1 for
	kernel-headers-modules-un-def=3.0.6-alt1
	E: Version ='1.3.0' for 'kernel-source-opendpi' was not found
	hsh-install: Failed to calculate package file list.

kernel-modules-rtl8168-un-def-8.025.00-alt1.196614.1
	Selected version kernel-headers-modules-un-def#1:3.0.6-alt1 for
	kernel-headers-modules-un-def=3.0.6-alt1
	E: Version ='8.025.00' for 'kernel-source-rtl8168' was not found
	hsh-install: Failed to calculate package file list.

kernel-modules-rtl8192-ovz-el-0018.1025-alt3.132640.37
	make[1]: Entering directory `/usr/src/linux-2.6.32-ovz-el-alt37'
	cc1: error: /usr/src/linux-2.6.32-ovz-el/include/linux/modversions.h: No such file
	or directory
	scripts/Makefile.build:49: *** CFLAGS was changed in
	"/usr/src/RPM/BUILD/kernel-source-rtl8192-0018.1025/HAL/rtl8192/Makefile". Fix it to
	use EXTRA_CFLAGS.  Stop.

kernel-modules-rtl8192-std-def-0018.1025-alt3.196614.0.M60P.1
	make[1]: Entering directory `/usr/src/linux-3.0.6-std-def-alt0.M60P.1'
	cc1: fatal error: /usr/src/linux-3.0.6-std-def/include/linux/modversions.h: No such
	file or directory
	compilation terminated.

kernel-modules-rtl8192-un-def-0018.1025-alt3.196614.1
	make[1]: Entering directory `/usr/src/linux-3.0.6-un-def-alt1'
	cc1: error: /usr/src/linux-3.0.6-un-def/include/linux/modversions.h: No such file
	or directory
	scripts/Makefile.build:49: *** CFLAGS was changed in
	"/usr/src/RPM/BUILD/kernel-source-rtl8192-0018.1025/HAL/rtl8192/Makefile". Fix it to
	use EXTRA_CFLAGS.  Stop.

plexus-archiver0a8-0:1.0-alt9_0.a8.1jpp5
	4/13K\r8/13K\r12/13K\r13/13K\r13K downloaded
	[WARNING] *** CHECKSUM FAILED - Error retrieving checksum file for
	JPP/maven2/poms/JPP-apache-commons-lang.pom - IGNORING
	Downloading:
	file:///usr/src/RPM/BUILD/plexus-archiver-1.0-alpha-8/.m2/repository/JPP/maven-surefire/booter.jar
	--
	4/332K\r8/332K\r12/332K\r16/332K\r20/332K\r24/332K\r28/332K\r32/332K\r36/332K\r40/332K\r44/332K
	\r48/332K\r52/332K\r56/332K\r60/332K\r64/332K\r68/332K\r72/332K\r76/332K\r80/332K\r84/332K\r88/332K
	\r92/332K\r96/332K\r100/332K\r104/332K\r108/332K\r112/332K\r116/332K\r120/332K\r124/332K\r128/332K
	\r132/332K\r136/332K\r140/332K\r144/332K\r148/332K\r152/332K\r156/332K\r160/332K\r164/332K
	\r168/332K\r172/332K\r176/332K\r180/332K\r184/332K\r188/332K\r192/332K\r196/332K\r200/332K
	\r204/332K\r208/332K\r212/332K\r216/332K\r220/332K\r224/332K\r228/332K\r232/332K\r236/332K
	\r240/332K\r244/332K\r248/332K\r252/332K\r256/332K\r260/332K\r264/332K\r268/332K\r272/332K
	\r276/332K\r280/332K\r284/332K\r288/332K\r292/332K\r296/332K\r300/332K\r304/332K\r308/332K
	\r312/332K\r316/332K\r320/332K\r324/332K\r328/332K\r332/332K\r332/332K\r332K downloaded
	[WARNING] *** CHECKSUM FAILED - Error retrieving checksum file for
	JPP/maven-surefire/booter.jar - IGNORING
	Downloading:
	file:///usr/src/RPM/BUILD/plexus-archiver-1.0-alpha-8/.m2/repository/JPP/maven-surefire/api.jar
	--
	4/633K\r8/633K\r12/633K\r16/633K\r20/633K\r24/633K\r28/633K\r32/633K\r36/633K\r40/633K\r44/633K
	\r48/633K\r52/633K\r56/633K\r60/633K\r64/633K\r68/633K\r72/633K\r76/633K\r80/633K\r84/633K\r88/633K
	\r92/633K\r96/633K\r100/633K\r104/633K\r108/633K\r112/633K\r116/633K\r120/633K\r124/633K\r128/633K
	\r132/633K\r136/633K\r140/633K\r144/633K\r148/633K\r152/633K\r156/633K\r160/633K\r164/633K
	\r168/633K\r172/633K\r176/633K\r180/633K\r184/633K\r188/633K\r192/633K\r196/633K\r200/633K
	\r204/633K\r208/633K\r212/633K\r216/633K\r220/633K\r224/633K\r228/633K\r232/633K\r236/633K
	\r240/633K\r244/633K\r248/633K\r252/633K\r256/633K\r260/633K\r264/633K\r268/633K\r272/633K
	\r276/633K\r280/633K\r284/633K\r288/633K\r292/633K\r296/633K\r300/633K\r304/633K\r308/633K
	\r312/633K\r316/633K\r320/633K\r324/633K\r328/633K\r332/633K\r336/633K\r340/633K\r344/633K
	\r348/633K\r352/633K\r356/633K\r360/633K\r364/633K\r368/633K\r372/633K\r376/633K\r380/633K
	\r384/633K\r388/633K\r392/633K\r396/633K\r400/633K\r404/633K\r408/633K\r412/633K\r416/633K
	\r420/633K\r424/633K\r428/633K\r432/633K\r436/633K\r440/633K\r444/633K\r448/633K\r452/633K
	\r456/633K\r460/633K\r464/633K\r468/633K\r472/633K\r476/633K\r480/633K\r484/633K\r488/633K
	\r492/633K\r496/633K\r500/633K\r504/633K\r508/633K\r512/633K\r516/633K\r520/633K\r524/633K
	\r528/633K\r532/633K\r536/633K\r540/633K\r544/633K\r548/633K\r552/633K\r556/633K\r560/633K\r564/633K
	\r568/633K\r572/633K\r576/633K\r580/633K\r584/633K\r588/633K\r592/633K\r596/633K\r600/633K\r604/633K
	\r608/633K\r612/633K\r616/633K\r620/633K\r624/633K\r628/633K\r632/633K\r633/633K\r633K downloaded
	[WARNING] *** CHECKSUM FAILED - Error retrieving checksum file for
	JPP/maven-surefire/api.jar - IGNORING
	Downloading:
	file:///usr/src/RPM/BUILD/plexus-archiver-1.0-alpha-8/.m2/repository/JPP/apache-commons-lang.jar
	--
	4/254K\r8/254K\r12/254K\r16/254K\r20/254K\r24/254K\r28/254K\r32/254K\r36/254K\r40/254K\r44/254K
	\r48/254K\r52/254K\r56/254K\r60/254K\r64/254K\r68/254K\r72/254K\r76/254K\r80/254K\r84/254K\r88/254K
	\r92/254K\r96/254K\r100/254K\r104/254K\r108/254K\r112/254K\r116/254K\r120/254K\r124/254K\r128/254K
	\r132/254K\r136/254K\r140/254K\r144/254K\r148/254K\r152/254K\r156/254K\r160/254K\r164/254K
	\r168/254K\r172/254K\r176/254K\r180/254K\r184/254K\r188/254K\r192/254K\r196/254K\r200/254K
	\r204/254K\r208/254K\r212/254K\r216/254K\r220/254K\r224/254K\r228/254K\r232/254K\r236/254K
	\r240/254K\r244/254K\r248/254K\r252/254K\r254/254K\r254K downloaded
	[WARNING] *** CHECKSUM FAILED - Error retrieving checksum file for
	JPP/apache-commons-lang.jar - IGNORING
	[INFO] [surefire:test]
	--
	1/1K\r1K downloaded
	[WARNING] *** CHECKSUM FAILED - Error retrieving checksum file for
	JPP/maven2/poms/JPP.maven-surefire-junit.pom - IGNORING
	Checking path /usr/share/maven2/repository/JPP/maven2/poms/JPP.maven-surefire-providers.pom
	for the pom
	--
	1/1K\r1K downloaded
	[WARNING] *** CHECKSUM FAILED - Error retrieving checksum file for
	JPP/maven2/poms/JPP.maven-surefire-providers.pom - IGNORING
	Downloading:
	file:///usr/src/RPM/BUILD/plexus-archiver-1.0-alpha-8/.m2/repository/JPP/maven-surefire/junit.jar
	--
	4/10K\r8/10K\r10/10K\r10K downloaded
	[WARNING] *** CHECKSUM FAILED - Error retrieving checksum file for
	JPP/maven-surefire/junit.jar - IGNORING
	[INFO] Surefire report directory:
	/usr/src/RPM/BUILD/plexus-archiver-1.0-alpha-8/target/surefire-reports
	--
	2/2K\r2K downloaded
	[WARNING] *** CHECKSUM FAILED - Error retrieving checksum file for
	JPP/maven2/poms/JPP.maven-shared-archiver.pom - IGNORING
	Checking path /usr/share/maven2/repository/JPP/maven2/poms/JPP.plexus-archiver.pom for
	the pom
	--
	4/6K\r6/6K\r6K downloaded
	[WARNING] *** CHECKSUM FAILED - Error retrieving checksum file for
	JPP/maven2/default_poms/JPP.plexus-archiver.pom - IGNORING
	Downloading:
	file:///usr/src/RPM/BUILD/plexus-archiver-1.0-alpha-8/.m2/repository/JPP/maven-shared/archiver.jar
	--
	4/11K\r8/11K\r11/11K\r11K downloaded
	[WARNING] *** CHECKSUM FAILED - Error retrieving checksum file for
	JPP/maven-shared/archiver.jar - IGNORING
	Downloading:
	file:///usr/src/RPM/BUILD/plexus-archiver-1.0-alpha-8/.m2/repository/JPP/plexus/archiver.jar

	12 error logs REMOVED from the list
kde4-digikam-1.9.0-alt1
kernel-modules-dahdi-ovz-el-2.5.0-alt2.132640.34
kernel-modules-dahdi-un-def-2.5.0-alt1.196612.1
kernel-modules-e1000e-ovz-el-1.2.20-alt1.132640.34
kernel-modules-ipset-ovz-el-4.4-alt4.M60P.1.132640.34
kernel-modules-ipt-netflow-ovz-el-1.0.1.7.1-alt1.132640.34
kernel-modules-nvidia-un-def-280.13-alt1.196612.1
kernel-modules-rtl8168-un-def-8.025.00-alt1.196612.1
kernel-modules-rtl8192-ovz-el-0018.1025-alt3.132640.34
kernel-modules-rtl8192-std-def-0018.1025-alt3.196612.0.M60P.2
kernel-modules-rtl8192-un-def-0018.1025-alt3.196612.1
kernel-modules-vhba-un-def-1.2.1.20110416-alt1.196612.1

Total 162 error logs.


^ permalink raw reply	[flat|nested] only message in thread

only message in thread, other threads:[~2011-10-16 15:06 UTC | newest]

Thread overview: (only message) (download: mbox.gz / follow: Atom feed)
-- links below jump to the message on this page --
2011-10-16 15:06 [cyber] I: t6-20111016 x86_64 beehive_status: +18 -12 (162) ALT beekeeper

ALT Linux Sisyphus cybertalk

This inbox may be cloned and mirrored by anyone:

	git clone --mirror http://lore.altlinux.org/sisyphus-cybertalk/0 sisyphus-cybertalk/git/0.git

	# If you have public-inbox 1.1+ installed, you may
	# initialize and index your mirror using the following commands:
	public-inbox-init -V2 sisyphus-cybertalk sisyphus-cybertalk/ http://lore.altlinux.org/sisyphus-cybertalk \
		sisyphus-cybertalk@lists.altlinux.org sisyphus-cybertalk@lists.altlinux.ru sisyphus-cybertalk@lists.altlinux.com
	public-inbox-index sisyphus-cybertalk

Example config snippet for mirrors.
Newsgroup available over NNTP:
	nntp://lore.altlinux.org/org.altlinux.lists.sisyphus-cybertalk


AGPL code for this site: git clone https://public-inbox.org/public-inbox.git