* [cyber] I: Sisyphus-20110628 i586 beehive_status: +36 -10 (90)
@ 2011-06-27 23:36 ALT beekeeper
0 siblings, 0 replies; only message in thread
From: ALT beekeeper @ 2011-06-27 23:36 UTC (permalink / raw)
To: sisyphus-cybertalk
36 NEW error logs
dogtail-0.7.0-alt2
File "<string>", line 1, in <module>
KeyError: 'zc'
gnome-activity-journal-0.5.0.1-alt1
File "<string>", line 1, in <module>
KeyError: 'zc'
kde4-digikam-1.9.0-alt1
cpp.req: WARNING:
/usr/src/tmp/kde4-digikam-buildroot/usr/include/kde4/digikam/imagelevels.h: cpp failed
/usr/src/tmp/kde4-digikam-buildroot/usr/include/kde4/digikam/imageplugin.h:30:26:
fatal error: QtCore/QObject: No such file or directory
compilation terminated.
cpp.req: /usr/src/tmp/kde4-digikam-buildroot/usr/include/kde4/digikam/imageplugin.h:
cpp failed, trying c++ mode
/usr/src/tmp/kde4-digikam-buildroot/usr/include/kde4/digikam/imageplugin.h:30:26:
fatal error: QtCore/QObject: No such file or directory
compilation terminated.
--
In file included from
/usr/src/tmp/kde4-digikam-buildroot/usr/include/kde4/digikam/iptcwidget.h:29:0:
/usr/src/tmp/kde4-digikam-buildroot/usr/include/kde4/digikam/metadatawidget.h:29:25:
fatal error: QtGui/QWidget: No such file or directory
compilation terminated.
--
In file included from
/usr/src/tmp/kde4-digikam-buildroot/usr/include/kde4/digikam/iptcwidget.h:29:0:
/usr/src/tmp/kde4-digikam-buildroot/usr/include/kde4/digikam/metadatawidget.h:29:25:
fatal error: QtGui/QWidget: No such file or directory
compilation terminated.
cpp.req: WARNING:
/usr/src/tmp/kde4-digikam-buildroot/usr/include/kde4/digikam/iptcwidget.h: cpp failed
/usr/src/tmp/kde4-digikam-buildroot/usr/include/kde4/digikam/knotificationwrapper.h:29:19:
fatal error: QString: No such file or directory
compilation terminated.
cpp.req:
/usr/src/tmp/kde4-digikam-buildroot/usr/include/kde4/digikam/knotificationwrapper.h:
cpp failed, trying c++ mode
/usr/src/tmp/kde4-digikam-buildroot/usr/include/kde4/digikam/knotificationwrapper.h:29:19:
fatal error: QString: No such file or directory
compilation terminated.
cpp.req: WARNING:
/usr/src/tmp/kde4-digikam-buildroot/usr/include/kde4/digikam/knotificationwrapper.h:
cpp failed
/usr/src/tmp/kde4-digikam-buildroot/usr/include/kde4/digikam/libsinfodlg.h:29:23:
fatal error: QtCore/QMap: No such file or directory
compilation terminated.
cpp.req: /usr/src/tmp/kde4-digikam-buildroot/usr/include/kde4/digikam/libsinfodlg.h:
cpp failed, trying c++ mode
/usr/src/tmp/kde4-digikam-buildroot/usr/include/kde4/digikam/libsinfodlg.h:29:23:
fatal error: QtCore/QMap: No such file or directory
compilation terminated.
--
In file included from
/usr/src/tmp/kde4-digikam-buildroot/usr/include/kde4/digikam/makernotewidget.h:30:0:
/usr/src/tmp/kde4-digikam-buildroot/usr/include/kde4/digikam/metadatawidget.h:29:25:
fatal error: QtGui/QWidget: No such file or directory
compilation terminated.
--
In file included from
/usr/src/tmp/kde4-digikam-buildroot/usr/include/kde4/digikam/makernotewidget.h:30:0:
/usr/src/tmp/kde4-digikam-buildroot/usr/include/kde4/digikam/metadatawidget.h:29:25:
fatal error: QtGui/QWidget: No such file or directory
compilation terminated.
libunwind-0.99-alt5.2
latex2man -t ./libunwind.trans unw_create_addr_space.tex unw_create_addr_space.man
make[1]: latex2man: Command not found
make[1]: *** [unw_create_addr_space.man] Error 127
openerp-client-5.0.14-alt2
File "<string>", line 1, in <module>
KeyError: 'zc'
perl-Gtk2-1.223-alt1
find-requires: running scripts
(cpp,debuginfo,files,gir-js,gir-python,gir,lib,pam,perl,pkgconfig,pkgconfiglib,python,rpmlib,shebang,shell,static,symlinks,typelib)
/usr/src/tmp/perl-Gtk2-buildroot/usr/lib/perl5/Gtk2/Install/gtk2perl.h:27:19: fatal
error: gperl.h: No such file or directory
compilation terminated.
cpp.req: /usr/src/tmp/perl-Gtk2-buildroot/usr/lib/perl5/Gtk2/Install/gtk2perl.h: cpp
failed, trying c++ mode
i586-alt-linux-cpp: error trying to exec 'cc1plus': execvp: No such file or directory
cpp.req: WARNING: /usr/src/tmp/perl-Gtk2-buildroot/usr/lib/perl5/Gtk2/Install/gtk2perl.h:
cpp failed
--
(EE) XKB: Failed to load keymap. Loading default keymap instead.
hasher-priv: master: idle time limit (3600 seconds) exceeded
perl-LWP-UserAgent-Determined-1.04-alt1
t/10_determined_test.t (Wstat: 0 Tests: 11 Failed: 2)
Failed tests: 9-10
Files=2, Tests=13, 113 wallclock secs ( 0.04 usr 0.04 sys + 0.14 cusr 0.10 csys =
0.32 CPU)
Result: FAIL
Failed 1/2 test programs. 2/13 subtests failed.
make: *** [test_dynamic] Error 255
proxychains-3.1-alt1
checking whether -lc should be explicitly linked in... no
checking dynamic linker characteristics... cat: /etc/ld.so.conf.d/*.conf: No such file
or directory
GNU/Linux ld.so
--
checking whether the i586-alt-linux-g++ linker (/usr/bin/ld) supports shared
libraries... yes
checking dynamic linker characteristics... cat: /etc/ld.so.conf.d/*.conf: No such file
or directory
GNU/Linux ld.so
--
libproxychains.c: At top level:
libproxychains.c:291:5: error: conflicting types for 'getnameinfo'
/usr/include/netdb.h:677:12: note: previous declaration of 'getnameinfo' was here
python-module-Axiom-0.6.0-alt1
File "<string>", line 1, in <module>
KeyError: 'zc'
python-module-Epsilon-0.6.0-alt1
File "<string>", line 1, in <module>
KeyError: 'zc'
python-module-PyQuante-1.6.3-alt2
File "<string>", line 1, in <module>
KeyError: 'zc'
python-module-hep-0.6-alt10.1
File "<string>", line 1, in <module>
KeyError: 'zc'
python-module-kaa-imlib2-0.2.3-alt1.1
File "<string>", line 1, in <module>
KeyError: 'zc'
python-module-kaa-metadata-0.7.5-alt2
File "<string>", line 1, in <module>
KeyError: 'zc'
python-module-networkx-1.4-alt1.svn20100829.2
File "<string>", line 1, in <module>
KeyError: 'zc'
python-module-numpy-2.0.0-alt2.git20110422
File "<string>", line 1, in <module>
KeyError: 'zc'
python-module-scipy-0.10.0-alt1.git20110402.3
File "<string>", line 1, in <module>
KeyError: 'zc'
python-module-stsci-2.11-alt1
File "<string>", line 1, in <module>
KeyError: 'zc'
python-module-supybot-plugins-Dicebot-0.5-alt1
File "<string>", line 1, in <module>
KeyError: 'zc'
python-module-twisted-conch-10.1.0-alt1
File "<string>", line 1, in <module>
KeyError: 'zc'
python-module-twisted-core-10.1.0-alt6
File "<string>", line 1, in <module>
KeyError: 'zc'
python-module-twisted-lore-10.1.0-alt1
File "<string>", line 1, in <module>
KeyError: 'zc'
python-module-twisted-mail-10.1.0-alt1
File "<string>", line 1, in <module>
KeyError: 'zc'
python-module-twisted-names-10.1.0-alt1
File "<string>", line 1, in <module>
KeyError: 'zc'
python-module-twisted-news-10.1.0-alt1
File "<string>", line 1, in <module>
KeyError: 'zc'
python-module-twisted-runner-10.1.0-alt1
File "<string>", line 1, in <module>
KeyError: 'zc'
python-module-twisted-web-10.1.0-alt1
File "<string>", line 1, in <module>
KeyError: 'zc'
python-module-twisted-web2-8.1.0-alt2
File "<string>", line 1, in <module>
KeyError: 'zc'
python-module-twisted-words-10.1.0-alt1
File "<string>", line 1, in <module>
KeyError: 'zc'
python-module-yarn-0.4pseudo_really0.2-alt5.1
File "<string>", line 1, in <module>
KeyError: 'zc'
python-module-yum-metadata-parser-1.1.4-alt1
File "<string>", line 1, in <module>
KeyError: 'zc'
rednotebook-1.1.1-alt1
File "<string>", line 1, in <module>
KeyError: 'zc'
ruby1.8-1.8.7-alt10
callback.func:1:1: warning: type defaults to 'int' in declaration of 'rg11'
callback.func:1:7: error: expected identifier or '(' before 'long'
In file included from dl.c:104:0:
callback.func:78:33: error: expected ')' before '(' token
callback.func:79:3: warning: data definition has no type or storage class
callback.func:79:3: warning: type defaults to 'int' in declaration of 'retval'
callback.func:79:24: error: 'proc' undeclared here (not in a function)
callback.func:79:39: error: 'argc' undeclared here (not in a function)
callback.func:79:45: error: 'argv' undeclared here (not in a function)
callback.func:82:1: error: expected identifier or '(' before '}' token
dl.c:106:1: error: expected ';', ',' or ')' before 'static'
dl.c:15:14: warning: 'rb_dl_callback_table' defined but not used
scikits-2267-alt2
customize UnixCCompiler using build_ext
/usr/lib/python2.6/site-packages/numpy/distutils/cpuinfo.py:116: UserWarning: [Errno 2]
No such file or directory: '/proc/cpuinfo'
warnings.warn(str(e), UserWarning)
--
File "<string>", line 1, in <module>
KeyError: 'zc'
sfepy-2011.1-alt1.git20110405
File "<string>", line 1, in <module>
KeyError: 'zc'
zsh-1:4.3.11-alt1
./Y03arguments.ztst: starting.
./Y03arguments.ztst: all tests successful.
36 successful test scripts, 3 failures, 0 skipped
make[1]: *** [check] Error 1
make[1]: Leaving directory `/usr/src/RPM/BUILD/zsh-4.3.11/Test'
make: *** [check] Error 2
make: Leaving directory `/usr/src/RPM/BUILD/zsh-4.3.11'
error: Bad exit status from /usr/src/tmp/rpm-tmp.38564 (%check)
RPM build errors:
Unparseable macro: % package size increase without any significant
10 error logs REMOVED from the list
doublecmd-0.4.6-alt1
fatresize-1.0.3-alt11.git20090730
gfdisk-1.2.4-alt2
mockito-0:1.8.5-alt2_0.1jpp6
ruby1.8-pkg-config-1.0.7-alt3
tcerl-1.3.1f-alt1
tcerldrv-1.3.1e-alt4
tor-0.2.1.27-alt2
xcrysden-1.5.21-alt3
xscreensaver-5.12-alt2
Total 90 error logs.
^ permalink raw reply [flat|nested] only message in thread
only message in thread, other threads:[~2011-06-27 23:36 UTC | newest]
Thread overview: (only message) (download: mbox.gz / follow: Atom feed)
-- links below jump to the message on this page --
2011-06-27 23:36 [cyber] I: Sisyphus-20110628 i586 beehive_status: +36 -10 (90) ALT beekeeper
ALT Linux Sisyphus cybertalk
This inbox may be cloned and mirrored by anyone:
git clone --mirror http://lore.altlinux.org/sisyphus-cybertalk/0 sisyphus-cybertalk/git/0.git
# If you have public-inbox 1.1+ installed, you may
# initialize and index your mirror using the following commands:
public-inbox-init -V2 sisyphus-cybertalk sisyphus-cybertalk/ http://lore.altlinux.org/sisyphus-cybertalk \
sisyphus-cybertalk@lists.altlinux.org sisyphus-cybertalk@lists.altlinux.ru sisyphus-cybertalk@lists.altlinux.com
public-inbox-index sisyphus-cybertalk
Example config snippet for mirrors.
Newsgroup available over NNTP:
nntp://lore.altlinux.org/org.altlinux.lists.sisyphus-cybertalk
AGPL code for this site: git clone https://public-inbox.org/public-inbox.git