ALT Linux Girar Builder robot reports
 help / color / mirror / Atom feed
From: "Girar awaiter (cas)" <girar-builder@altlinux.org>
To: Andrey Cherepanov <cas@altlinux.org>
Cc: girar-builder-p10@altlinux.org,
	sisyphus-incominger@lists.altlinux.org,
	girar-builder-p10@lists.altlinux.org
Subject: [#330703] p10 FAILED (try 11) python3-module-uc-micro-py.git=1.0.1-alt1 ...
Date: Sat, 7 Oct 2023 14:17:34 +0000
Message-ID: <girar.task.330703.11.1@gyle.mskdc.altlinux.org> (raw)
In-Reply-To: <girar.task.330703.1.1@gyle.mskdc.altlinux.org>

https://git.altlinux.org/tasks/330703/logs/events.11.1.log

subtask  name                               aarch64  armh    i586  ppc64le  x86_64
     #4  python3-module-uc-micro-py              50  1:14      27       59      26
    #25  python3-module-pytest-regressions        ?     ?      23        ?      23
    #27  python3-module-linkify-it-py             ?     ?  failed        ?  failed

2023-Oct-07 14:15:50 :: task #330703 for p10 resumed by cas:
2023-Oct-07 14:15:50 :: message: New_version_(bootstrapped)
#4 build 1.0.1-alt1 from /gears/p/python3-module-uc-micro-py.git fetched at 2023-Oct-07 14:15:42
#10 removed
#20 build 3.9.0-alt1 from /gears/p/python3-module-flit.git fetched at 2023-Oct-06 11:11:04 from sisyphus
#24 build 0.1.2-alt1 from /gears/p/python3-module-mdurl.git fetched at 2023-Oct-06 13:10:17 from sisyphus
#25 build 2.4.1-alt1 from /gears/p/python3-module-pytest-regressions.git fetched at 2023-Oct-06 13:45:45
#26 removed
#27 build 2.0.2-alt1 from /gears/p/python3-module-linkify-it-py.git fetched at 2023-Oct-06 13:49:41 from sisyphus
#30 build 3.0.0-alt1 from /gears/p/python3-module-markdown-it.git fetched at 2023-Oct-06 11:19:37 from sisyphus
#40 build 2.0.0-alt1 from /gears/p/python3-module-myst-parser.git fetched at 2023-Oct-06 10:23:27 from sisyphus
#100 removed
#200 build 16.0.6-alt6 from /gears/l/llvm16.0.git fetched at 2023-Oct-06 09:58:32 from sisyphus
#300 build 1.72.1-alt0.p10.1 from /people/cas/packages/rust.git fetched at 2023-Oct-06 10:06:02
2023-Oct-07 14:15:50 :: created build repo
2023-Oct-07 14:15:51 :: #25: force rebuild
2023-Oct-07 14:15:51 :: #40: force rebuild
2023-Oct-07 14:15:51 :: #200: force rebuild
2023-Oct-07 14:15:51 :: [i586] #4 python3-module-uc-micro-py.git 1.0.1-alt1: build start
2023-Oct-07 14:15:51 :: [armh] #4 python3-module-uc-micro-py.git 1.0.1-alt1: build start
2023-Oct-07 14:15:51 :: [x86_64] #4 python3-module-uc-micro-py.git 1.0.1-alt1: build start
2023-Oct-07 14:15:51 :: [aarch64] #4 python3-module-uc-micro-py.git 1.0.1-alt1: build start
2023-Oct-07 14:15:51 :: [ppc64le] #4 python3-module-uc-micro-py.git 1.0.1-alt1: build start
2023-Oct-07 14:16:17 :: [x86_64] #4 python3-module-uc-micro-py.git 1.0.1-alt1: build OK
2023-Oct-07 14:16:18 :: [x86_64] #20 python3-module-flit.git 3.9.0-alt1: build start
2023-Oct-07 14:16:18 :: [i586] #4 python3-module-uc-micro-py.git 1.0.1-alt1: build OK
2023-Oct-07 14:16:18 :: [i586] #20 python3-module-flit.git 3.9.0-alt1: build start
2023-Oct-07 14:16:27 :: [x86_64] #20 python3-module-flit.git 3.9.0-alt1: build OK (cached)
2023-Oct-07 14:16:27 :: [i586] #20 python3-module-flit.git 3.9.0-alt1: build OK (cached)
2023-Oct-07 14:16:27 :: [x86_64] #24 python3-module-mdurl.git 0.1.2-alt1: build start
2023-Oct-07 14:16:27 :: [i586] #24 python3-module-mdurl.git 0.1.2-alt1: build start
2023-Oct-07 14:16:36 :: [x86_64] #24 python3-module-mdurl.git 0.1.2-alt1: build OK (cached)
2023-Oct-07 14:16:36 :: [i586] #24 python3-module-mdurl.git 0.1.2-alt1: build OK (cached)
2023-Oct-07 14:16:36 :: [x86_64] #25 python3-module-pytest-regressions.git 2.4.1-alt1: build start
2023-Oct-07 14:16:36 :: [i586] #25 python3-module-pytest-regressions.git 2.4.1-alt1: build start
2023-Oct-07 14:16:41 :: [aarch64] #4 python3-module-uc-micro-py.git 1.0.1-alt1: build OK
2023-Oct-07 14:16:41 :: [aarch64] #20 python3-module-flit.git 3.9.0-alt1: build start
2023-Oct-07 14:16:50 :: [ppc64le] #4 python3-module-uc-micro-py.git 1.0.1-alt1: build OK
2023-Oct-07 14:16:51 :: [ppc64le] #20 python3-module-flit.git 3.9.0-alt1: build start
2023-Oct-07 14:16:59 :: [x86_64] #25 python3-module-pytest-regressions.git 2.4.1-alt1: build OK
2023-Oct-07 14:16:59 :: [x86_64] #27 python3-module-linkify-it-py.git 2.0.2-alt1: build start
2023-Oct-07 14:16:59 :: [i586] #25 python3-module-pytest-regressions.git 2.4.1-alt1: build OK
2023-Oct-07 14:17:00 :: [i586] #27 python3-module-linkify-it-py.git 2.0.2-alt1: build start
2023-Oct-07 14:17:01 :: [aarch64] #20 python3-module-flit.git 3.9.0-alt1: build OK (cached)
2023-Oct-07 14:17:01 :: [aarch64] #24 python3-module-mdurl.git 0.1.2-alt1: build start
2023-Oct-07 14:17:05 :: [armh] #4 python3-module-uc-micro-py.git 1.0.1-alt1: build OK
2023-Oct-07 14:17:05 :: [armh] #20 python3-module-flit.git 3.9.0-alt1: build start
2023-Oct-07 14:17:11 :: [ppc64le] #20 python3-module-flit.git 3.9.0-alt1: build OK (cached)
2023-Oct-07 14:17:11 :: [ppc64le] #24 python3-module-mdurl.git 0.1.2-alt1: build start
[x86_64]       "pytest-benchmark; extra == \"benchmark\"",
[x86_64]       "pytest-cov; extra == \"test\"",
[x86_64]       "pytest; extra == \"benchmark\"",
[x86_64]       "pytest; extra == \"test\"",
[x86_64]       "sphinx-book-theme; extra == \"doc\"",
[x86_64]       "sphinx; extra == \"doc\"",
[x86_64]       "uc-micro-py"
[x86_64] error: Bad exit status from /usr/src/tmp/rpm-tmp.99077 (%prep)
[x86_64] RPM build errors:
[x86_64]     File /usr/src/RPM/SOURCES/python3-module-linkify-it-py-2.0.2-alt.patch is smaller than 8 bytes
2023-Oct-07 14:17:17 :: [x86_64] python3-module-linkify-it-py.git 2.0.2-alt1: remote: build failed
2023-Oct-07 14:17:17 :: [x86_64] #27 python3-module-linkify-it-py.git 2.0.2-alt1: build FAILED
2023-Oct-07 14:17:17 :: [x86_64] requesting cancellation of task processing
[i586]       "pytest-benchmark; extra == \"benchmark\"",
[i586]       "pytest-cov; extra == \"test\"",
[i586]       "pytest; extra == \"benchmark\"",
[i586]       "pytest; extra == \"test\"",
[i586]       "sphinx-book-theme; extra == \"doc\"",
[i586]       "sphinx; extra == \"doc\"",
[i586]       "uc-micro-py"
[i586] error: Bad exit status from /usr/src/tmp/rpm-tmp.33576 (%prep)
[i586] RPM build errors:
[i586]     File /usr/src/RPM/SOURCES/python3-module-linkify-it-py-2.0.2-alt.patch is smaller than 8 bytes
2023-Oct-07 14:17:18 :: [i586] python3-module-linkify-it-py.git 2.0.2-alt1: remote: build failed
2023-Oct-07 14:17:18 :: [i586] #27 python3-module-linkify-it-py.git 2.0.2-alt1: build FAILED
2023-Oct-07 14:17:20 :: [aarch64] #24 python3-module-mdurl.git 0.1.2-alt1: build OK (cached)
2023-Oct-07 14:17:20 :: [aarch64] task processing CANCELLED
2023-Oct-07 14:17:31 :: [ppc64le] #24 python3-module-mdurl.git 0.1.2-alt1: build OK (cached)
2023-Oct-07 14:17:31 :: [ppc64le] task processing CANCELLED
2023-Oct-07 14:17:33 :: [armh] #20 python3-module-flit.git 3.9.0-alt1: build OK (cached)
2023-Oct-07 14:17:33 :: [armh] task processing CANCELLED
2023-Oct-07 14:17:17 :: [x86_64] build FAILED
2023-Oct-07 14:17:18 :: [i586] build FAILED
2023-Oct-07 14:17:21 :: [aarch64] build FAILED
2023-Oct-07 14:17:32 :: [ppc64le] build FAILED
2023-Oct-07 14:17:33 :: [armh] build FAILED
2023-Oct-07 14:17:34 :: task #330703 for p10 FAILED


  parent reply	other threads:[~2023-10-07 14:17 UTC|newest]

Thread overview: 22+ messages / expand[flat|nested]  mbox.gz  Atom feed  top
2023-09-30 15:50 [#330703] p10 FAILED rust.git=1.72.1-alt0.p10.1 Girar awaiter (cas)
2023-10-06 10:08 ` [#330703] p10 FAILED (try 2) llvm16.0.git=16.0.6-alt6 rust.git=1.72.1-alt0.p10.1 Girar awaiter (cas)
2023-10-06 10:24 ` [#330703] p10 FAILED (try 3) python3-module-myst-parser.git=2.0.0-alt1 llvm16.0.git=16.0.6-alt6 Girar awaiter (cas)
2023-10-06 11:13 ` [#330703] p10 FAILED (try 4) python3-module-flit.git=3.9.0-alt1 Girar awaiter (cas)
2023-10-06 11:20 ` [#330703] p10 FAILED (try 5) python3-module-flit.git=3.9.0-alt1 Girar awaiter (cas)
2023-10-06 13:13 ` [#330703] p10 FAILED (try 6) python3-module-flit.git=3.9.0-alt1 python3-module-mdurl.git=0.1.2-alt1 Girar awaiter (cas)
2023-10-06 13:16 ` [#330703] p10 FAILED (try 7) " Girar awaiter (cas)
2023-10-06 13:48 ` [#330703] p10 FAILED (try 8) " Girar awaiter (cas)
2023-10-06 13:51 ` [#330703] p10 FAILED (try 9) " Girar awaiter (cas)
2023-10-07  8:55 ` [#330703] p10 FAILED (try 10) python3-module-uc-micro-py.git=1.0.2-alt1 Girar awaiter (cas)
2023-10-07 14:17 ` Girar awaiter (cas) [this message]
2023-10-07 14:29 ` [#330703] p10 FAILED (try 12) python3-module-uc-micro-py.git=1.0.1-alt1 Girar awaiter (cas)
2023-10-07 16:09 ` [#330703] p10 FAILED (try 13) python3-module-uc-micro-py.git=1.0.1-alt1 Girar awaiter (cas)
2023-10-07 16:17 ` [#330703] p10 FAILED (try 14) python3-module-uc-micro-py.git=1.0.1-alt1 Girar awaiter (cas)
2023-10-07 16:29 ` [#330703] p10 FAILED (try 15) python3-module-uc-micro-py.git=1.0.1-alt1 Girar awaiter (cas)
2023-10-08 14:59 ` [#330703] p10 FAILED (try 16) python3-module-uc-micro-py.git=1.0.1-alt1 Girar awaiter (cas)
2023-10-08 16:31 ` [#330703] p10 FAILED (try 17) python3-module-uc-micro-py.git=1.0.1-alt1 Girar awaiter (cas)
2023-10-08 16:45 ` [#330703] p10 FAILED (try 18) python3-module-uc-micro-py.git=1.0.1-alt1 Girar awaiter (cas)
2023-10-08 16:53 ` [#330703] p10 FAILED (try 19) python3-module-uc-micro-py.git=1.0.1-alt1 Girar awaiter (cas)
2023-10-08 17:07 ` [#330703] p10 FAILED (try 20) python3-module-uc-micro-py.git=1.0.1-alt1 Girar awaiter (cas)
2023-10-08 17:20 ` [#330703] p10 FAILED (try 21) python3-module-uc-micro-py.git=1.0.1-alt1 Girar awaiter (cas)
2023-10-09  1:03 ` [#330703] p10 FAILED (try 22) python3-module-uc-micro-py.git=1.0.1-alt1 Girar awaiter (cas)

Reply instructions:

You may reply publicly to this message via plain-text email
using any one of the following methods:

* Save the following mbox file, import it into your mail client,
  and reply-to-all from there: mbox

  Avoid top-posting and favor interleaved quoting:
  https://en.wikipedia.org/wiki/Posting_style#Interleaved_style

* Reply using the --to, --cc, and --in-reply-to
  switches of git-send-email(1):

  git send-email \
    --in-reply-to=girar.task.330703.11.1@gyle.mskdc.altlinux.org \
    --to=girar-builder@altlinux.org \
    --cc=cas@altlinux.org \
    --cc=devel@lists.altlinux.org \
    --cc=girar-builder-p10@altlinux.org \
    --cc=girar-builder-p10@lists.altlinux.org \
    --cc=sisyphus-incominger@lists.altlinux.org \
    /path/to/YOUR_REPLY

  https://kernel.org/pub/software/scm/git/docs/git-send-email.html

* If your mail client supports setting the In-Reply-To header
  via mailto: links, try the mailto: link

ALT Linux Girar Builder robot reports

This inbox may be cloned and mirrored by anyone:

	git clone --mirror http://lore.altlinux.org/sisyphus-incominger/0 sisyphus-incominger/git/0.git

	# If you have public-inbox 1.1+ installed, you may
	# initialize and index your mirror using the following commands:
	public-inbox-init -V2 sisyphus-incominger sisyphus-incominger/ http://lore.altlinux.org/sisyphus-incominger \
		sisyphus-incominger@lists.altlinux.org sisyphus-incominger@lists.altlinux.ru sisyphus-incominger@lists.altlinux.com
	public-inbox-index sisyphus-incominger

Example config snippet for mirrors.
Newsgroup available over NNTP:
	nntp://lore.altlinux.org/org.altlinux.lists.sisyphus-incominger


AGPL code for this site: git clone https://public-inbox.org/public-inbox.git